{"text_format":"1","workbook":"xlsx","n_sheets":12,"sheets":["Table 1 SA4","Table 2 LGA","Graph NSW SA4 24 months","Graph LGA 24 months","Graph NSW SA4 60 months","Graph LGA 60 months","Graph NSW SA4 120 months","Graph LGA 120 months","Working SA4","Working LGA","Module1","KendallMod"],"not_rendered":{"charts":6,"images":2,"macros":1,"external_links":0,"defined_names":15,"comments":0,"pivot_tables":0},"unopened":[{"sheet":"Module1","index":10,"reason":"part_missing"},{"sheet":"KendallMod","index":11,"reason":"part_missing"}],"bounds":{"document_bytes":16777216,"sheet_cells":100000,"rows_first":2000,"rows_last":500,"rows_between":2000,"halvings":0,"cell_chars":16384,"cell_head_chars":4096},"cells_cut":0,"cells_raw":0,"read":"whole","date_system":"1900"}

{"sheet":"Table 1 SA4","index":0,"n_rows":52,"n_cols":145,"rows_kept":52,"cut":false,"hidden":false,"merged":[[40,0,40,10],[43,0,43,10],[5,5,5,14],[5,15,5,24],[44,0,44,10]]}
["NSW Recorded Crime Statistics - DV assault regional comparison tool, July 2014 to June 2024"]
["Table 1. Domestic violence* related assault incidents recorded by the NSW Police Force, July 2014 to June 2024, by Statistical Area, trend^, ratio to NSW~, rate per 100,000 population and count"]
[]
[]
[]
[null,null,null,null,null,"Rate per 100,000 population",null,null,null,null,null,null,null,null,null,"Number"]
["NSW Statistical Area","Two year trend (%)","Five year trend (annual average % change)","Ten year trend (annual average % change)","Ratio to NSW","July 2014 - June 2015","July 2015 - June 2016","July 2016 - June 2017","July 2017 - June 2018","July 2018 - June 2019","July 2019 - June 2020","July 2020 - June 2021","July 2021 - June 2022","July 2022 - June 2023","July 2023 - June 2024","July 2014 - June 2015","July 2015 - June 2016","July 2016 - June 2017","July 2017 - June 2018","July 2018 - June 2019","July 2019 - June 2020","July 2020 - June 2021","July 2021 - June 2022","July 2022 - June 2023","July 2023 - June 2024","2014-07-01","2014-08-01","2014-09-01","2014-10-01","2014-11-01","2014-12-01","2015-01-01","2015-02-01","2015-03-01","2015-04-01","2015-05-01","2015-06-01","2015-07-01","2015-08-01","2015-09-01","2015-10-01","2015-11-01","2015-12-01","2016-01-01","2016-02-01","2016-03-01","2016-04-01","2016-05-01","2016-06-01","2016-07-01","2016-08-01","2016-09-01","2016-10-01","2016-11-01","2016-12-01","2017-01-01","2017-02-01","2017-03-01","2017-04-01","2017-05-01","2017-06-01","2017-07-01","2017-08-01","2017-09-01","2017-10-01","2017-11-01","2017-12-01","2018-01-01","2018-02-01","2018-03-01","2018-04-01","2018-05-01","2018-06-01","2018-07-01","2018-08-01","2018-09-01","2018-10-01","2018-11-01","2018-12-01","2019-01-01","2019-02-01","2019-03-01","2019-04-01","2019-05-01","2019-06-01","2019-07-01","2019-08-01","2019-09-01","2019-10-01","2019-11-01","2019-12-01","2020-01-01","2020-02-01","2020-03-01","2020-04-01","2020-05-01","2020-06-01","2020-07-01","2020-08-01","2020-09-01","2020-10-01","2020-11-01","2020-12-01","2021-01-01","2021-02-01","2021-03-01","2021-04-01","2021-05-01","2021-06-01","2021-07-01","2021-08-01","2021-09-01","2021-10-01","2021-11-01","2021-12-01","2022-01-01","2022-02-01","2022-03-01","2022-04-01","2022-05-01","2022-06-01","2022-07-01","2022-08-01","2022-09-01","2022-10-01","2022-11-01","2022-12-01","2023-01-01","2023-02-01","2023-03-01","2023-04-01","2023-05-01","2023-06-01","2023-07-01","2023-08-01","2023-09-01","2023-10-01","2023-11-01","2023-12-01","2024-01-01","2024-02-01","2024-03-01","2024-04-01","2024-05-01","2024-06-01"]
["Greater Sydney",6.9,2.5,2.5,0.82027833449999998,324.2,323.3,315.60000000000002,309.2,325.89999999999998,341.2,343.7,323.7,350.7,375,15984,16246,16213,16157,17304,18032,18084,17163,18599,19886,1235,1250,1240,1427,1389,1465,1484,1284,1456,1310,1224,1220,1185,1285,1195,1360,1482,1527,1437,1416,1566,1320,1259,1214,1238,1201,1253,1371,1406,1607,1618,1398,1435,1284,1253,1149,1171,1176,1293,1427,1330,1622,1578,1279,1431,1328,1194,1328,1271,1264,1311,1400,1466,1886,1709,1438,1493,1406,1328,1332,1366,1419,1427,1511,1509,1716,1778,1452,1625,1304,1391,1534,1377,1423,1428,1581,1616,1685,1572,1437,1516,1538,1518,1393,1297,1198,1229,1449,1589,1627,1534,1398,1618,1465,1421,1338,1487,1568,1481,1516,1534,1662,1640,1633,1714,1454,1375,1535,1524,1571,1586,1636,1625,1906,1712,1681,1873,1636,1582,1554]
["Baulkham Hills and Hawkesbury","Stable","Stable",2.6,0.34968362800000002,148.4,152.4,132.30000000000001,137.30000000000001,149.19999999999999,191.6,186.1,161,184.5,159.9,343,359,319,337,375,497,494,437,501,434,26,32,29,22,34,24,28,24,32,41,22,29,32,32,25,32,36,33,24,23,44,23,32,23,19,26,23,26,26,25,36,30,17,30,30,31,21,20,27,30,26,37,27,23,38,23,29,36,25,28,16,32,27,39,32,23,43,32,38,40,36,33,33,27,48,47,53,40,60,33,42,45,34,32,37,36,42,44,35,42,51,40,48,53,29,29,32,41,30,43,48,35,36,34,45,35,36,43,49,39,41,41,44,42,45,31,38,52,28,34,34,34,36,31,37,36,45,36,35,48]
["Blacktown","Stable","Stable",1.4,1.1723678289999999,572.5,577.29999999999995,574.6,557.6,603.1,562,569.6,469.3,516.5,536,1959,2025,2071,2057,2275,2220,2302,1948,2144,2225,164,144,152,171,182,178,186,137,168,154,160,163,135,163,158,168,188,186,173,181,196,169,148,160,151,147,154,170,180,241,222,164,189,172,145,136,168,127,167,167,186,195,199,172,188,162,165,161,168,139,172,222,214,243,204,186,209,170,188,160,180,189,167,195,191,194,257,158,205,149,155,180,159,197,179,200,193,200,220,190,231,195,165,173,170,141,139,155,185,187,162,153,184,154,174,144,164,196,161,191,187,215,160,176,185,180,150,179,155,157,172,175,188,229,204,186,211,171,179,198]
["Central Coast","Stable",2.5,2.7,1.0962540385999999,413.5,488.4,495.2,496,458.5,456.4,412.1,464.5,497.5,501.2,1378,1644,1681,1695,1577,1584,1436,1622,1737,1750,99,108,101,109,126,137,135,111,129,122,86,115,103,124,85,145,136,152,161,173,152,147,123,143,114,132,138,148,159,168,162,155,155,143,111,96,103,122,123,142,152,183,166,127,154,169,122,132,105,134,129,123,127,181,185,125,151,119,99,99,136,131,140,155,116,175,155,138,126,106,91,115,109,129,108,144,115,162,132,111,121,96,100,109,111,129,99,133,149,167,161,117,154,150,118,134,122,130,122,178,135,167,174,150,148,160,118,133,133,153,128,157,167,157,153,162,167,120,136,117]
["City and Inner South","Stable",2.8,2.6,1.0592182523,406.4,376.7,383.9,374.6,409.4,423.5,449.1,426.6,480.4,484.3,1312,1263,1340,1345,1506,1474,1506,1451,1634,1647,92,94,124,111,108,135,133,111,116,113,83,92,97,112,95,111,105,140,102,113,101,93,104,90,102,100,104,121,108,124,131,114,132,104,116,84,107,114,103,137,102,123,132,94,122,102,103,106,102,117,119,96,112,157,136,151,137,125,105,149,103,120,121,114,113,150,151,122,129,123,107,121,126,119,116,134,142,139,113,152,109,123,121,112,121,87,107,115,113,143,143,118,146,117,128,113,139,144,132,130,143,132,141,143,181,131,112,106,146,144,134,123,122,146,153,116,146,147,150,120]
["Eastern Suburbs","Stable","Stable",1.6,0.59752615870000003,221.7,229.6,224,198.4,226.6,259.39999999999998,250.4,260.7,279.60000000000002,273.2,624,653,649,581,668,714,660,687,737,720,36,42,49,61,45,60,56,45,70,65,50,45,43,50,61,45,60,80,57,54,61,57,45,40,48,36,54,59,65,65,59,52,67,51,42,51,47,39,43,59,43,59,75,40,49,45,35,47,57,28,52,60,53,83,80,49,53,55,47,51,66,64,47,56,74,85,60,66,55,43,53,45,63,37,50,46,87,57,59,51,52,51,47,60,53,56,63,73,66,61,52,44,58,58,43,60,48,46,65,69,61,65,70,71,72,68,59,43,71,72,66,67,54,60,66,53,79,54,39,39]
["Inner South West","Stable",4.3,2.2000000000000002,0.87875995730000001,341.2,351.5,340.9,282.8,320.39999999999998,335.9,362,333,386.9,401.8,2009,2103,2083,1752,2008,2065,2199,2023,2351,2441,179,157,121,204,181,160,195,166,179,160,154,153,174,184,142,180,197,201,164,160,225,152,164,160,159,164,155,167,168,216,225,190,205,156,145,133,113,138,156,163,155,165,160,135,149,135,120,163,156,166,155,158,144,238,209,149,161,148,172,152,160,157,163,207,177,190,196,158,173,147,148,189,174,182,196,183,202,206,160,152,172,176,246,150,157,133,172,197,193,188,144,153,217,166,170,133,202,200,184,161,198,231,213,210,192,155,158,247,198,162,232,191,197,233,186,195,223,228,201,195]
["Inner West","Stable",7.8,3.4,0.58533421470000002,199.8,202.4,167.1,182.5,149.30000000000001,194.1,189.9,221.9,249.6,267.60000000000002,604,623,525,582,484,607,582,679,764,819,52,42,49,42,66,59,40,43,67,40,45,59,51,46,49,52,56,55,60,47,72,54,38,43,35,43,38,54,31,53,47,45,45,47,47,40,46,62,44,65,60,45,41,48,44,44,45,38,47,40,36,42,40,41,38,43,39,38,33,47,49,47,46,60,52,56,51,44,47,75,46,34,31,62,42,40,43,51,59,40,65,69,32,48,43,41,45,42,77,70,65,44,61,75,72,44,50,50,58,74,59,78,68,70,67,53,75,62,69,54,58,54,69,96,57,65,92,72,64,69]
["North Sydney and Hornsby",15.3,7,4.5999999999999996,0.35333645000000002,109.6,108.8,106.4,109.3,115.2,120.7,136.1,125.6,140.1,161.5,457,461,459,477,508,524,580,534,596,687,32,49,32,37,41,47,35,32,37,39,42,34,31,28,36,40,46,49,44,39,50,33,30,35,45,32,39,35,39,38,52,38,41,37,33,30,36,34,41,41,26,50,40,37,51,38,36,47,52,38,25,39,40,61,51,46,34,41,39,42,50,41,31,25,53,30,56,43,56,39,58,42,44,46,56,40,64,39,47,32,43,49,73,47,46,43,36,41,43,47,45,55,40,45,50,43,41,50,52,39,48,39,56,59,41,58,55,58,45,57,65,69,62,54,59,58,53,41,52,72]
["Northern Beaches",26.4,-6.6,"Stable",0.26666823350000002,133.30000000000001,121.3,125.7,142.1,175.9,157.69999999999999,124,102.5,96.5,121.9,350,322,338,385,481,422,328,270,254,321,32,30,22,23,30,31,44,22,32,36,24,24,30,28,29,26,26,25,21,36,25,33,18,25,30,19,20,22,20,36,31,31,38,43,22,26,12,28,28,24,21,54,50,35,39,31,34,29,24,24,34,44,44,60,55,33,43,48,36,36,50,25,40,53,35,33,32,28,30,34,24,38,13,27,40,31,28,26,23,24,25,36,34,21,24,22,25,20,21,22,20,26,20,29,22,19,19,13,21,22,25,30,18,23,19,24,25,15,15,24,25,24,28,34,40,33,29,19,30,20]
["Outer South West",26,5.5,2.6,1.1779659828,493.9,455.4,450.4,445.4,455.7,448.2,444.9,426.1,427.4,538.5,1298,1227,1244,1261,1318,1321,1331,1296,1300,1638,95,89,98,117,125,115,130,103,112,108,105,101,85,89,89,88,115,121,137,114,136,89,101,63,105,104,100,84,136,115,120,98,90,93,108,91,75,82,104,119,97,132,145,104,98,110,87,108,97,120,95,102,103,160,127,111,116,103,105,79,72,99,103,118,131,129,152,107,129,80,86,115,104,105,91,100,130,133,138,106,90,139,90,105,96,74,88,124,134,103,112,122,129,110,101,103,98,139,127,106,113,116,120,120,111,90,84,76,109,116,137,128,131,156,149,143,171,155,121,122]
["Outer West and Blue Mountains",10.6,"Stable",1.6,1.1212358675,479.9,456.4,477.4,493.2,507,538.5,489.6,454.9,463.5,512.6,1495,1439,1524,1595,1660,1785,1636,1529,1558,1723,115,133,135,115,122,133,134,122,138,116,123,109,89,109,110,115,119,156,114,137,134,124,104,128,104,118,107,121,143,156,137,129,122,117,157,113,122,122,118,144,131,153,158,134,150,120,107,136,139,147,137,147,156,132,144,120,128,153,128,129,123,127,157,156,125,185,165,131,150,120,157,189,147,129,137,176,158,139,124,134,118,129,140,105,89,106,112,126,144,159,142,121,120,153,118,139,111,125,111,120,122,126,133,138,177,150,117,128,125,138,141,161,139,205,130,148,154,89,137,156]
["Parramatta","Stable","Stable",2,0.93125924140000005,390.7,360.4,342.1,345.1,351.4,389.3,405.7,360,390.1,425.8,1779,1681,1647,1701,1768,1955,2016,1795,1945,2123,131,142,170,194,130,178,156,146,146,131,137,118,132,123,117,122,191,145,153,130,167,138,137,126,147,113,106,143,134,147,167,150,139,111,124,166,127,110,144,148,131,190,175,146,143,129,129,129,125,121,140,137,164,202,169,159,127,139,143,142,121,164,152,130,136,181,192,174,206,135,184,180,153,127,152,175,169,207,188,174,173,161,184,153,147,114,103,126,154,162,155,173,164,163,161,173,222,172,129,150,166,143,187,164,175,131,149,157,179,189,160,159,176,187,197,160,207,208,147,154]
["Ryde","Stable",-3,6.7,0.4002282613,112.6,140.30000000000001,143.9,146,191.4,206.9,205.4,154.19999999999999,144.4,183,209,266,280,291,392,423,417,316,296,375,16,18,12,16,19,25,24,21,14,13,10,21,17,16,19,27,38,17,41,19,15,21,17,19,29,19,20,19,30,15,22,35,25,14,29,23,29,16,25,24,22,25,20,23,22,27,26,32,22,28,24,22,39,41,34,21,46,43,36,36,37,27,32,27,32,33,37,40,23,42,48,45,27,32,35,34,32,33,42,34,39,38,41,30,24,27,24,23,31,29,33,26,29,24,34,12,27,27,25,30,22,24,24,24,21,19,22,31,24,35,20,32,15,48,37,40,36,25,35,28]
["South West",12.8,8.1999999999999993,3.8,1.0929997541000001,423.9,401.9,366,364.6,378,377.9,403.6,389,442.9,499.7,1733,1690,1585,1619,1719,1771,1923,1890,2152,2428,133,146,108,170,141,139,148,162,171,139,148,128,119,134,146,165,143,134,142,143,153,130,155,126,119,114,152,153,135,172,160,115,136,126,111,92,135,129,125,126,134,162,148,124,138,147,124,127,125,102,147,142,162,195,174,158,151,125,117,121,128,146,149,137,147,168,154,149,164,133,140,156,147,148,150,175,140,201,158,144,162,183,145,170,125,143,131,187,194,193,175,156,188,133,138,127,157,189,186,170,157,183,187,198,211,148,168,198,177,189,172,225,185,220,195,236,215,224,219,171]
["Sutherland","Stable",-4.5999999999999996,2.8,0.52486781059999998,193.2,217,206,209.6,245.5,292.2,292.5,296.60000000000002,272.39999999999998,240,434,490,468,479,565,670,674,686,630,555,33,24,38,35,39,44,40,39,45,33,35,29,47,47,34,44,26,33,44,47,35,57,43,33,31,34,43,49,32,36,47,52,34,40,33,37,30,33,45,38,44,49,42,37,46,46,32,37,27,32,30,34,41,53,71,64,55,67,42,49,55,49,46,51,79,60,67,54,72,45,52,40,46,51,39,67,71,48,74,51,65,53,52,57,62,53,53,46,55,53,77,55,72,54,47,59,51,44,59,37,57,72,45,45,69,56,45,50,50,47,42,37,56,50,49,50,45,47,37,45]
["Regional NSW","Stable",5.9,3.2,1.3319571822,487.9,481.9,458.9,455.8,477.3,493,524,517,574.79999999999995,608.9,13105,13049,12534,12558,13256,13851,14857,14801,16457,17434,884,981,1094,1074,1263,1329,1324,1109,1078,915,1089,965,951,1014,1031,1145,1246,1226,1283,1106,1133,964,997,953,989,972,1023,1089,1137,1208,1247,1064,1087,919,878,921,866,899,955,1081,1076,1328,1267,1050,1128,1008,990,910,984,1038,993,1099,1097,1412,1364,1113,1140,1031,966,1019,997,1083,1101,1165,1267,1438,1382,1125,1182,949,1064,1098,936,1166,1189,1215,1297,1479,1459,1224,1234,1157,1230,1271,1109,1107,1060,1177,1250,1492,1480,1294,1330,1139,1249,1114,1213,1318,1318,1409,1398,1523,1574,1418,1474,1253,1250,1309,1396,1420,1322,1402,1494,1677,1589,1517,1544,1409,1368,1296]
["Capital Region","Stable",6.4,4.7,0.92985710210000005,305,335.5,298.10000000000002,323.60000000000002,298.39999999999998,338.7,362.9,368.2,423.4,425.1,677,751,673,737,686,798,866,886,1019,1023,42,51,53,45,65,59,71,61,58,56,59,57,66,60,43,77,67,73,78,65,66,67,41,48,61,53,54,44,62,55,76,58,67,39,47,57,59,64,50,64,60,75,89,67,60,34,60,55,53,60,61,50,64,83,72,44,45,54,50,50,72,54,71,63,71,66,67,71,62,55,80,66,40,72,66,75,84,99,75,82,64,63,79,67,61,80,59,67,73,94,94,80,66,63,74,75,76,80,75,87,93,77,94,87,73,92,90,95,88,82,93,90,79,80,87,98,79,95,72,80]
["Central West","Stable",3.6,1.6,1.4454020902,589.79999999999995,539.6,505.8,505.6,535.29999999999995,575.6,636.9,643.1,689.3,660.8,1232,1134,1069,1074,1142,1227,1360,1377,1476,1415,87,88,109,82,125,126,119,132,74,104,92,94,101,84,78,115,101,105,111,101,87,85,79,87,79,80,88,84,86,105,97,85,83,87,103,92,68,87,84,84,85,119,112,90,105,72,86,82,85,82,82,79,74,128,127,112,101,95,94,83,89,98,93,119,119,102,127,118,121,73,82,86,73,106,110,93,119,124,114,113,114,129,131,134,108,106,104,113,109,122,121,122,118,113,133,108,136,128,90,162,121,145,137,118,123,107,113,96,121,133,104,95,125,127,133,124,104,128,120,101]
["Coffs Harbour - Grafton","Stable",13.9,5.7,1.7555033087,519.4,522.1,522.29999999999995,552.9,467,489.1,596.5,528.29999999999995,722,802.6,718,727,732,780,663,705,872,780,1066,1185,48,56,52,47,66,97,91,52,47,52,66,44,44,61,45,70,58,67,82,60,66,47,69,58,57,81,52,55,67,75,85,66,55,42,46,51,55,51,57,65,66,98,76,67,72,51,53,69,53,59,53,50,61,72,71,47,42,49,52,54,50,54,46,61,55,86,67,65,68,50,48,55,59,78,81,80,72,81,87,56,69,60,66,83,64,57,48,52,58,70,78,83,79,54,66,71,74,66,102,108,71,67,113,91,104,81,95,94,112,90,86,96,115,139,116,83,96,99,89,64]
["Far West and Orana",12.6,4.5999999999999996,3.6,3.7351266096,1238.8,1088.4000000000001,993.5,1089.8,1417.7,1423.5,1379.1,1376.3,1516.4,1707.6,1449,1271,1160,1277,1658,1668,1616,1612,1776,2000,96,88,112,134,146,157,178,134,109,88,117,90,78,91,118,116,138,128,135,93,94,103,78,99,98,84,79,98,106,117,86,89,114,92,99,98,82,73,103,109,100,122,144,114,112,112,124,82,113,130,131,164,127,156,176,126,161,100,123,151,87,141,126,159,158,167,214,133,148,93,125,117,100,124,138,130,153,142,165,147,112,134,140,131,133,117,117,125,121,190,164,119,131,110,163,122,127,127,151,142,151,168,156,152,177,141,140,144,157,156,172,176,194,198,184,164,175,139,164,121]
["Hunter Valley excluding Newcastle","Stable",10.9,5,1.5230692450000001,505.5,525.29999999999995,488.6,520.6,486.5,480.6,493.4,494,587.5,696.3,1344,1414,1332,1441,1365,1380,1446,1480,1760,2086,90,101,109,109,114,119,111,123,133,80,155,100,88,113,111,119,154,135,121,113,132,106,114,108,106,118,98,152,121,123,112,116,118,103,79,86,103,81,119,138,141,147,122,123,139,122,116,90,111,113,102,114,113,143,133,124,115,123,83,91,79,110,109,129,118,158,122,107,120,108,102,118,107,108,109,114,109,154,139,146,127,98,125,110,103,120,97,102,107,135,148,160,136,122,120,130,114,162,131,121,154,172,183,155,146,150,123,149,188,199,174,171,170,211,181,170,201,148,122,151]
["Illawarra","Stable","Stable","Stable",0.68719573349999996,342.4,371.2,308.3,290.10000000000002,303.60000000000002,299.5,316.2,278.89999999999998,297.2,314.2,1026,1124,946,902,955,935,993,886,944,998,79,69,75,93,99,128,95,90,88,60,77,73,81,89,78,99,109,94,116,118,89,90,95,66,95,59,100,78,67,80,106,85,84,64,68,60,68,69,69,85,76,95,71,66,94,86,65,58,69,68,72,69,82,104,96,87,71,76,95,66,74,68,68,63,90,99,77,87,90,73,65,81,76,61,118,74,69,95,118,64,82,82,72,82,72,60,52,80,82,81,81,78,69,68,87,76,76,71,65,92,89,89,87,76,85,75,67,72,84,85,82,77,83,101,91,80,89,73,74,79]
["Mid North Coast","Stable",9.4,5.0999999999999996,1.4950168080999999,474.2,476.2,453.8,436.7,464.4,488.9,592.20000000000005,564.9,670.6,683.5,1016,1029,991,963,1034,1107,1356,1310,1555,1585,51,72,83,81,98,105,114,82,87,84,83,76,69,68,90,94,106,97,90,90,95,71,71,88,79,91,72,99,71,102,94,80,99,75,59,70,55,67,71,97,63,116,105,80,96,64,64,85,89,97,76,81,114,101,77,87,82,89,70,71,98,95,80,112,102,115,98,92,97,77,75,66,64,101,98,114,128,150,132,121,122,90,105,131,101,103,95,96,128,146,160,115,91,86,97,92,97,119,127,114,140,157,182,138,143,105,117,116,134,100,119,134,137,147,147,141,145,139,103,139]
["Murray","Stable",6.7,4.8,1.4452120065,459.6,413.8,429.5,437.4,418.6,519.6,497.6,572.4,612.6,660.7,538,488,511,525,506,635,614,713,763,823,37,50,44,41,53,55,47,33,40,38,49,51,39,28,49,27,44,44,53,51,49,31,39,34,42,39,45,46,42,54,46,51,46,39,23,38,22,41,48,36,36,60,55,48,40,55,41,43,30,40,33,49,39,59,55,38,51,34,35,43,52,59,43,40,61,64,57,66,59,36,53,45,33,60,45,47,45,55,70,72,53,41,44,49,37,54,59,65,76,77,76,67,57,53,52,40,54,79,77,56,79,69,57,67,63,40,64,58,61,91,66,68,55,63,80,78,68,41,87,65]
["New England and North West",15.8,7.5,3.9,2.1358460386,705.7,682.5,680.6,639.1,684.9,733.9,803.3,820,842.9,976.5,1306,1267,1268,1193,1281,1374,1502,1541,1584,1835,89,100,115,110,145,132,135,92,99,92,98,99,104,100,99,103,122,132,129,102,124,86,90,76,91,94,112,110,148,129,137,105,104,89,75,74,87,91,74,108,101,126,128,109,113,88,70,98,74,101,88,117,93,147,145,106,117,93,93,107,97,95,112,99,126,150,144,110,99,91,118,133,99,113,103,132,114,162,147,98,147,125,132,130,95,123,119,136,122,144,149,138,157,122,113,123,128,129,119,127,142,156,150,131,142,125,112,123,147,133,114,135,154,200,171,175,169,152,137,148]
["Newcastle and Lake Macquarie","Stable",3.3,1.7,0.95039285230000004,401.5,397.6,418.2,387.2,380.1,390.8,386.4,412.3,429.2,434.5,1474,1469,1558,1454,1439,1512,1512,1634,1701,1722,100,109,116,119,160,122,169,124,142,99,111,103,98,125,130,120,120,128,146,128,131,117,124,102,110,107,118,120,157,161,180,119,122,120,120,124,105,130,107,125,144,139,133,129,108,122,126,86,107,91,121,116,123,145,143,121,136,126,91,119,125,127,140,137,145,150,136,92,123,107,120,110,92,115,110,128,160,159,131,121,118,128,126,124,115,110,107,130,144,169,145,145,176,138,139,116,129,123,112,161,136,152,170,151,147,137,143,140,130,145,104,133,157,160,137,160,151,147,165,133]
["Richmond - Tweed","Stable",6.3,1,0.90786432539999995,401.3,342.2,358,343.8,386,329.9,436.1,413.5,401.5,415.1,979,844,890,862,975,841,1120,1070,1039,1074,74,85,106,100,74,97,78,67,95,70,72,61,76,73,73,74,66,87,73,73,56,63,67,63,62,68,73,70,83,87,95,97,77,57,59,62,63,50,72,62,83,96,89,55,69,80,75,68,74,88,76,78,80,102,99,90,92,64,74,58,81,61,81,42,75,95,87,51,67,56,72,73,70,83,89,95,108,119,113,96,86,73,93,95,75,69,82,81,115,111,111,93,90,90,88,65,86,91,87,95,89,98,78,95,90,81,73,76,69,65,90,86,72,101,87,108,102,104,110,80]
["Riverina","Stable","Stable",3.3,1.4672379441000001,520.79999999999995,632.5,561.29999999999995,571.1,630.1,692.6,622.1,585.70000000000005,709.7,670.8,825,1008,899,919,1018,1133,1022,964,1168,1104,53,66,77,66,73,74,74,66,78,56,72,70,71,81,72,89,99,97,87,69,95,74,83,91,74,68,87,79,78,74,80,73,81,80,62,63,72,55,71,75,91,100,90,75,70,78,77,65,85,62,63,71,83,113,107,90,80,96,73,95,60,103,87,99,94,134,123,84,82,88,80,99,85,89,74,92,84,94,101,58,98,82,74,91,95,60,88,74,78,103,82,60,107,83,73,61,75,97,124,83,87,117,117,102,114,76,79,97,57,97,75,95,110,87,118,85,110,93,81,96]
["Southern Highlands and Shoalhaven","Stable","Stable",1.3,0.78769632690000002,350.8,346.9,331,278.89999999999998,341,337.7,359.4,337.9,373.7,360.1,521,523,505,431,534,536,578,548,606,584,38,46,43,47,45,58,42,53,28,36,38,47,36,41,45,42,62,39,62,43,49,24,47,33,35,30,45,54,49,46,53,40,37,32,38,46,27,40,30,33,30,35,53,27,50,44,33,29,41,47,35,61,44,59,63,41,47,32,33,31,33,18,45,42,53,52,63,49,46,42,44,49,38,56,48,41,52,45,67,50,42,52,43,44,50,48,33,56,37,50,71,34,53,37,44,35,41,46,58,61,46,56,50,55,67,43,34,49,48,44,43,46,43,63,57,51,55,51,44,39]
["NSW**",6.5,4,2.8,1,382,379,365.4,359.9,377.9,394,406.9,391.5,429.3,457.2,29094,29305,28753,28720,30566,31888,32948,31969,35059,37332,2119,2232,2334,2501,2653,2795,2808,2393,2534,2226,2313,2186,2136,2300,2226,2507,2729,2755,2720,2523,2700,2285,2257,2167,2227,2174,2276,2460,2543,2815,2866,2463,2522,2204,2133,2070,2037,2075,2249,2509,2406,2951,2846,2329,2559,2336,2185,2238,2255,2303,2304,2501,2563,3298,3073,2551,2633,2439,2295,2351,2363,2502,2528,2676,2779,3155,3160,2577,2807,2253,2455,2633,2313,2591,2618,2796,2914,3164,3032,2661,2751,2695,2749,2664,2407,2306,2290,2626,2839,3119,3015,2693,2948,2604,2670,2452,2700,2886,2800,2926,2932,3185,3214,3051,3189,2707,2625,2844,2921,2993,2909,3038,3123,3585,3302,3199,3417,3045,2950,2850]
[]
["Notes:"]
["* NSW Police flag whether criminal incidents that they record on their COPS (Computerised Operational Policing System) database are domestic violence-related. New South Wales police define domestic assault in line with the Crimes (Domestic and Personal Violence) Act 2007. Under this legislation a person has a domestic relationship with another if they are a spouse/partner, ex spouse/ex partner, boy/girlfriend (including ex), parent/guardian (including step/foster), child (including step/foster), sibling, other member of family (including kin), is living or has lived in the same household as other person, is dependant on the paid or unpaid care of the other person, or are involved in a \"love triangle\" (e.g. a woman’s ex-partner and current partner would have a domestic relationship with each other for the purposes of this Act even if they had never met). "]
["** Includes incidents occurring on prison premises."]
[]
["^BOCSAR relies upon the Kendall Rank Order Correlation statistical test (or Kendall's tau-b) to determine whether a series is trending upwards, downwards or is stable (p<.05).  The statistical test is applied to the monthly count data over the specified period. Where a significant trend is found, the average annual percentage change over the time period is reported. If any of the 12-monthly totals in the series have a value of less than 20, a trend test is not conducted. When this occurs, the relevant cell will be left blank or contain 'n.c.' (not calculated).  Significant upward tends are in red and significant downward trends are in green."]
["~The ratio to NSW rate statistics are a comparison of a NSW regional rate per 100,000 population to the  NSW rate per 100,000 population. A ratio of one indicates parity with the NSW rate. Ratios indicating double the NSW rate (or more) before rounding are highlighted in red, whilst ratios indicating half the NSW rate (or less) before rounding are highlighted in green. Ratios are not calculated for regions with a population of less than 3,000. "]
[]
["For the rate calculations, specialised population data were prepared and provided to BOCSAR by the Australian Bureau of Statistics."]
[]
["Source: NSW Bureau of Crime Statistics and Research"]
["Please retain this reference number for future correspondence."]
["NOTE: Data sourced from the NSW Bureau of Crime Statistics and Research must be acknowledged in any document (electronic or otherwise) containing that data."]
["The acknowledgement should take the form of 'Source: NSW Bureau of Crime Statistics and Research'."]

{"sheet":"Table 2 LGA","index":1,"n_rows":153,"n_cols":146,"rows_kept":153,"cut":false,"hidden":false,"merged":[[147,0,147,10],[5,6,5,15],[5,16,5,25],[140,0,140,10],[142,0,142,10],[143,0,143,10]]}
["NSW Recorded Crime Statistics - DV assault regional comparison tool, July 2014 to June 2024"]
["Table 2. Domestic violence* related assault incidents recorded by the NSW Police Force, July 2014 to June 2024, by Local Government Area, trend^, ratio to NSW~, rank, rate per 100,000 population and count"]
[]
[]
[]
[null,null,null,null,null,null,"Rate per 100,000 population",null,null,null,null,null,null,null,null,null,"Number"]
["NSW Local Government Area","Two year trend (%)","Five year trend (annual average % change)","Ten year trend (annual average % change)","Ratio to NSW","Rank","July 2014 - June 2015","July 2015 - June 2016","July 2016 - June 2017","July 2017 - June 2018","July 2018 - June 2019","July 2019 - June 2020","July 2020 - June 2021","July 2021 - June 2022","July 2022 - June 2023","July 2023 - June 2024","July 2014 - June 2015","July 2015 - June 2016","July 2016 - June 2017","July 2017 - June 2018","July 2018 - June 2019","July 2019 - June 2020","July 2020 - June 2021","July 2021 - June 2022","July 2022 - June 2023","July 2023 - June 2024","2014-07-01","2014-08-01","2014-09-01","2014-10-01","2014-11-01","2014-12-01","2015-01-01","2015-02-01","2015-03-01","2015-04-01","2015-05-01","2015-06-01","2015-07-01","2015-08-01","2015-09-01","2015-10-01","2015-11-01","2015-12-01","2016-01-01","2016-02-01","2016-03-01","2016-04-01","2016-05-01","2016-06-01","2016-07-01","2016-08-01","2016-09-01","2016-10-01","2016-11-01","2016-12-01","2017-01-01","2017-02-01","2017-03-01","2017-04-01","2017-05-01","2017-06-01","2017-07-01","2017-08-01","2017-09-01","2017-10-01","2017-11-01","2017-12-01","2018-01-01","2018-02-01","2018-03-01","2018-04-01","2018-05-01","2018-06-01","2018-07-01","2018-08-01","2018-09-01","2018-10-01","2018-11-01","2018-12-01","2019-01-01","2019-02-01","2019-03-01","2019-04-01","2019-05-01","2019-06-01","2019-07-01","2019-08-01","2019-09-01","2019-10-01","2019-11-01","2019-12-01","2020-01-01","2020-02-01","2020-03-01","2020-04-01","2020-05-01","2020-06-01","2020-07-01","2020-08-01","2020-09-01","2020-10-01","2020-11-01","2020-12-01","2021-01-01","2021-02-01","2021-03-01","2021-04-01","2021-05-01","2021-06-01","2021-07-01","2021-08-01","2021-09-01","2021-10-01","2021-11-01","2021-12-01","2022-01-01","2022-02-01","2022-03-01","2022-04-01","2022-05-01","2022-06-01","2022-07-01","2022-08-01","2022-09-01","2022-10-01","2022-11-01","2022-12-01","2023-01-01","2023-02-01","2023-03-01","2023-04-01","2023-05-01","2023-06-01","2023-07-01","2023-08-01","2023-09-01","2023-10-01","2023-11-01","2023-12-01","2024-01-01","2024-02-01","2024-03-01","2024-04-01","2024-05-01","2024-06-01"]
["Albury","Stable",7.6,4.9000000000000004,1.7601760089,24,576.9,475.4,564.29999999999995,556.70000000000005,472.9,614.29999999999995,601.1,721.8,711.2,804.7,297,248,299,299,257,340,337,409,403,456,18,30,23,23,25,27,32,23,15,17,34,30,17,18,22,14,25,21,18,28,29,16,20,20,18,27,23,32,24,29,28,31,29,22,10,26,15,20,28,21,26,27,28,26,22,32,30,24,16,17,16,27,18,30,24,29,31,14,13,22,28,31,27,22,25,31,27,38,36,20,33,22,12,33,23,25,30,29,34,45,31,22,22,31,23,33,30,36,48,50,39,49,34,25,23,19,30,42,35,32,41,39,35,27,32,23,37,30,35,54,34,48,32,31,44,43,37,17,48,33]
["Armidale Regional","Stable","Stable","Stable",1.6464556408,30,698.8,521.20000000000005,506.3,629.1,627.29999999999995,585.4,760.3,732.3,688,752.7,211,158,155,193,187,173,223,215,202,221,11,16,14,18,23,22,20,11,20,18,20,18,18,20,8,14,10,18,8,14,16,11,14,7,18,4,10,13,21,10,18,13,10,16,13,9,18,13,9,16,22,14,21,16,19,13,14,18,13,20,11,14,9,26,20,14,17,6,20,17,10,18,11,16,12,19,13,11,22,12,15,14,18,17,17,17,8,19,20,11,29,17,24,26,14,18,12,18,25,23,21,18,16,16,17,17,12,15,9,22,15,27,22,17,14,19,11,19,21,19,13,19,18,26,20,21,17,19,11,17]
["Ballina",25,13.6,3.3,0.72366224450000005,85,274,225.6,257.60000000000002,240,262.2,204.1,326.89999999999998,309.5,264.7,330.8,116,97,112,106,117,93,151,145,124,155,10,8,16,15,11,14,6,7,10,6,3,10,4,9,7,12,12,7,8,13,3,8,8,6,10,8,13,7,13,12,13,10,5,9,10,2,11,2,10,10,8,14,10,2,7,12,14,6,12,12,10,14,8,5,7,10,14,16,4,5,10,4,12,5,4,7,7,8,10,5,12,9,2,8,7,20,12,28,13,15,18,7,8,13,12,7,8,10,27,9,21,10,9,12,10,10,10,8,10,12,16,15,4,8,11,9,7,14,11,5,12,14,9,15,19,15,13,16,15,11]
["Balranald","n.c.","n.c.","n.c.",".","n.c.","      . ","      . ","      . ","      . ","      . ","      . ","      . ","      . ","      . ","      . ",12,9,5,4,11,15,8,7,10,16,0,0,2,0,2,2,2,2,0,1,1,0,1,1,0,1,0,1,2,0,2,0,1,0,0,0,0,0,0,0,0,2,0,2,0,1,0,0,1,1,0,0,0,0,0,0,0,2,1,1,1,2,1,3,0,0,1,0,0,1,4,0,0,0,3,1,1,1,2,0,1,2,2,0,0,0,1,3,1,0,1,0,0,0,1,0,1,0,2,1,2,0,0,0,0,0,0,1,2,0,2,2,1,0,1,1,0,0,1,0,0,1,0,1,7,0,0,1,0,5]
["Bathurst Regional",-20.2,"Stable",1.8,1.3140229096,47,539.6,497.1,429.8,553.70000000000005,486.1,542,744.1,648.29999999999995,752.6,600.70000000000005,225,210,184,239,212,235,325,286,332,265,22,24,21,12,21,27,21,21,12,16,14,14,17,20,14,27,12,20,19,15,18,18,15,15,8,19,16,19,10,15,17,21,19,11,13,16,18,18,18,28,21,14,30,19,20,12,17,24,15,14,15,19,15,24,26,15,17,15,20,17,15,21,22,23,19,28,14,23,30,12,17,11,19,16,23,23,23,27,24,24,35,26,36,49,26,19,15,29,18,34,25,23,19,30,25,23,28,23,21,38,20,39,34,30,23,24,32,20,27,23,25,16,25,29,27,22,17,21,14,19]
["Bayside",-14.9,"Stable",3.5,0.74859222999999997,79,281.39999999999998,289.89999999999998,317.7,318,340.9,378.9,371.7,356.3,402.4,342.2,448,477,541,554,608,666,655,634,716,609,38,34,25,49,38,35,41,32,35,42,42,37,43,36,16,39,42,58,60,33,49,25,41,35,41,34,42,50,50,60,48,58,51,48,34,25,42,48,34,33,60,42,59,49,54,53,38,42,40,39,40,47,52,72,61,46,40,57,46,68,50,39,51,50,70,68,64,52,66,51,54,51,69,58,52,44,60,48,48,64,49,58,67,38,51,45,46,50,51,60,56,47,63,56,65,44,61,74,52,46,67,61,72,64,68,51,37,63,54,55,60,43,46,51,51,45,43,68,49,44]
["Bega Valley","Stable","Stable","Stable",0.58348182559999995,101,252.1,347.7,299,300.2,290.10000000000002,330.9,346.7,336.2,261.2,266.8,85,118,102,103,100,117,124,121,94,96,4,11,7,1,9,7,7,12,4,6,9,8,13,7,2,10,12,14,12,14,12,9,7,6,12,10,4,1,9,10,12,8,14,5,8,9,12,9,7,7,4,12,17,10,4,6,11,4,15,7,11,2,8,12,6,8,5,13,9,4,13,6,14,6,14,4,6,12,13,7,12,10,8,7,9,8,8,18,14,17,8,7,16,4,5,12,9,8,15,10,10,15,7,11,9,10,5,6,5,6,10,7,10,5,7,8,12,13,4,6,10,11,6,8,4,15,10,5,7,10]
["Bellingen","Stable","Stable",8.6999999999999993,0.90712571379999996,73,201,239.4,316.60000000000002,301.10000000000002,292.5,388.5,499.9,211.1,490.1,414.7,26,31,41,39,38,51,66,28,65,55,4,1,1,0,0,3,5,1,0,1,7,3,3,3,2,4,1,2,4,3,1,0,1,7,0,3,3,7,4,3,11,0,1,0,3,6,3,3,0,3,2,2,5,7,3,2,3,6,2,4,5,1,2,6,6,3,0,4,2,3,5,4,2,6,0,7,2,7,5,5,2,6,5,6,9,4,1,5,9,3,5,5,4,10,3,0,3,3,2,3,1,8,0,2,3,0,2,1,7,8,6,4,7,10,5,8,7,0,9,2,3,6,5,4,4,2,7,3,4,6]
["Berrigan","Stable","n.c.","n.c.",1.1375215211,57,198.4,185.9,184.6,172.4,205.7,173.7,243.8,381.4,635.6,520.1,17,16,16,15,18,15,21,33,55,45,0,1,0,1,2,3,1,0,1,2,2,4,1,1,2,2,2,1,2,3,0,1,1,0,3,0,1,2,0,2,1,2,1,2,1,1,0,2,2,1,0,0,5,2,0,0,0,3,0,4,2,3,1,3,2,0,1,1,1,0,1,5,0,1,0,3,1,1,1,0,1,1,2,3,0,3,1,3,2,0,2,1,3,1,0,1,2,6,3,2,3,3,2,3,4,4,2,6,3,7,7,3,2,8,7,1,6,3,3,12,8,4,2,3,2,4,2,2,2,1]
["Blacktown","Stable","Stable",1.4,1.175384368,55,573,580.70000000000005,577.4,559.70000000000005,605,562.5,570.4,470.9,517.9,537.4,1945,2021,2066,2049,2265,2200,2281,1935,2128,2208,164,142,152,168,182,176,185,137,168,149,160,162,135,163,157,168,188,186,170,181,196,169,148,160,151,147,154,169,180,241,220,164,189,172,143,136,166,127,167,166,186,194,199,172,187,162,164,159,165,138,172,221,213,243,204,185,209,169,188,158,180,189,166,193,190,193,257,155,202,148,154,173,158,196,175,196,192,198,220,190,231,192,164,169,169,140,139,154,184,187,159,153,181,153,173,143,162,194,161,191,185,212,160,176,184,178,149,176,155,156,172,173,187,226,202,185,208,171,177,196]
["Bland","Stable","n.c.","n.c.",1.5128948811,38,331.8,332,317.3,384.7,335,283.8,541.1,509.6,709.9,691.7,20,20,19,23,20,16,30,28,39,38,2,0,1,3,6,3,0,1,0,3,0,1,1,1,4,1,4,2,1,0,2,4,0,0,1,2,9,1,1,0,0,1,1,1,2,0,3,2,0,3,1,6,0,4,2,0,1,1,3,2,0,0,1,1,1,3,2,4,0,3,0,2,2,1,2,0,2,2,2,0,0,3,1,2,1,3,3,1,4,11,1,2,0,1,4,0,12,3,1,2,0,2,1,0,2,1,3,1,8,2,4,1,0,1,6,7,3,3,0,7,5,1,5,6,2,5,1,2,1,3]
["Blayney","Stable","Stable","n.c.",1.0373309153000001,63,327.8,272.39999999999998,190.5,531.79999999999995,271.10000000000002,307.89999999999998,505.9,303,368.9,474.2,24,20,14,39,20,23,38,23,28,36,2,2,3,2,2,4,0,0,1,2,1,5,5,1,1,1,2,1,1,1,2,1,1,3,2,2,0,1,1,0,2,1,2,1,1,1,0,3,4,5,9,8,0,3,1,2,0,4,2,1,1,0,1,4,2,2,3,1,3,0,3,0,1,2,3,1,5,0,4,1,1,2,1,3,1,4,4,8,3,5,2,1,1,5,2,0,1,2,4,3,1,3,3,3,0,1,1,2,0,5,2,8,2,2,1,3,0,2,4,3,4,4,2,5,3,0,1,3,0,7]
["Blue Mountains","Stable","Stable","Stable",0.60359042929999995,98,286.5,261.3,354.4,282.89999999999998,290.7,247.2,268,286.2,326,275.89999999999998,226,206,280,224,230,195,210,223,254,215,17,14,16,22,18,22,18,12,23,25,24,15,12,21,14,18,13,20,20,25,14,14,14,21,17,17,32,23,26,27,25,18,18,16,37,24,24,22,23,21,17,22,23,23,17,10,11,11,25,22,24,23,21,25,19,14,13,23,9,12,11,11,17,15,6,25,16,14,14,12,24,30,17,16,16,15,24,15,6,20,24,18,16,23,12,11,15,22,24,19,20,12,19,26,11,32,25,23,17,18,20,25,19,23,24,19,18,23,24,14,16,16,10,22,18,22,17,15,20,21]
["Bogan","Stable","Stable","n.c.",".","n.c.","      . ","      . ","      . ","      . ","      . ","      . ","      . ","      . ","      . ","      . ",26,28,24,28,16,20,22,23,35,24,4,2,0,0,3,0,7,7,1,0,0,2,4,1,0,3,3,4,3,1,3,4,1,1,6,2,1,1,2,2,1,0,5,0,3,1,1,1,2,2,2,2,6,1,3,4,4,0,1,1,1,0,0,1,3,5,0,1,1,2,2,0,2,1,1,5,0,1,2,1,4,1,2,4,1,2,1,2,1,3,2,0,3,1,0,1,1,0,1,4,8,1,1,4,0,2,1,4,6,1,2,2,3,2,6,0,7,1,0,2,0,0,3,1,4,1,4,3,2,4]
["Bourke","Stable",13.5,3.6,".","n.c.","      . ","      . ","      . ","      . ","      . ","      . ","      . ","      . ","      . ","      . ",127,110,85,94,113,105,135,109,148,174,5,12,9,7,14,13,17,15,3,5,19,8,7,8,13,11,11,18,7,11,4,10,5,5,5,13,6,8,12,6,7,7,5,8,2,6,12,6,8,7,9,12,11,8,2,7,5,7,15,7,7,13,11,10,12,9,9,5,8,7,7,6,10,8,11,9,7,10,13,7,6,11,3,12,14,9,16,12,16,9,5,11,18,10,11,11,4,7,8,11,11,10,4,5,15,12,11,10,7,11,12,14,12,16,7,16,19,13,17,20,15,14,23,9,18,12,18,4,11,13]
["Brewarrina","Stable","Stable","Stable",".","n.c.","      . ","      . ","      . ","      . ","      . ","      . ","      . ","      . ","      . ","      . ",85,39,51,40,44,72,69,64,47,63,8,4,4,12,9,8,9,7,10,4,6,4,6,0,5,1,4,3,2,3,8,2,2,3,7,4,6,6,0,5,2,4,2,4,7,4,3,2,6,2,2,5,0,4,4,4,3,5,6,8,1,5,0,4,2,5,5,2,3,3,2,11,3,14,4,7,12,4,4,4,1,6,3,4,8,8,10,3,5,11,5,4,1,7,2,4,3,12,6,6,5,6,6,5,3,6,0,6,4,3,4,6,6,1,3,3,4,7,11,7,7,4,5,3,8,3,6,0,7,2]
["Broken Hill","Stable",9.6999999999999993,6.2,4.1084755704000004,4,1045.8,916.4,816.4,1134.5999999999999,1253.0999999999999,1289,1319.2,1218.0999999999999,1849.8,1878.3,192,166,146,201,219,228,233,214,325,330,14,14,15,12,19,19,30,25,7,8,18,11,10,16,12,17,14,12,23,14,10,11,16,11,16,14,8,12,11,10,6,13,18,12,11,15,17,9,22,24,18,19,17,23,13,13,18,8,13,11,18,14,26,33,23,16,10,18,19,18,13,14,22,15,12,23,36,24,24,13,18,14,14,18,14,26,22,23,30,24,15,13,10,24,19,12,18,25,20,21,29,10,13,20,19,8,30,25,25,23,21,31,24,23,45,25,16,37,21,22,39,39,23,46,29,25,21,20,24,21]
["Burwood","Stable",23.2,6.5,0.69103949529999997,94,193,186.8,205.9,173.1,147.80000000000001,138,210.2,247.4,274.3,315.89999999999998,73,72,81,69,60,56,85,101,112,129,5,7,7,1,10,6,3,5,10,6,7,6,7,4,8,7,7,5,10,5,4,9,2,4,5,3,5,8,8,8,10,9,7,5,8,5,7,9,6,7,10,3,8,8,2,2,4,3,5,5,3,9,6,4,5,4,2,5,6,6,5,2,8,7,3,7,3,4,7,7,2,1,1,14,8,8,10,4,5,5,15,5,5,5,4,10,10,6,11,11,5,6,11,13,9,5,11,6,6,16,7,11,8,11,11,7,8,10,8,9,9,14,10,18,11,10,9,12,9,10]
["Byron","Stable","Stable","Stable",0.69496025549999996,92,329.2,272.5,317.5,289.5,333.6,297.5,346.2,312.2,339.6,317.7,108,91,108,100,117,106,125,114,124,116,7,7,16,14,8,7,8,8,13,11,5,4,8,5,5,8,7,8,13,11,3,4,9,10,8,8,7,11,6,7,16,11,11,4,7,12,7,11,2,9,14,8,8,8,7,10,8,8,6,8,11,10,12,12,9,10,12,10,6,11,5,9,10,4,12,14,10,9,8,11,9,5,14,11,2,7,7,12,11,11,8,18,11,13,9,8,10,12,8,9,12,15,8,8,6,9,11,14,11,14,9,4,10,12,14,8,9,8,7,6,8,10,7,9,13,14,15,11,10,6]
["Cabonne","Stable","Stable","Stable",0.80579097219999996,78,362.7,265.2,205.7,219.5,278.8,253.9,203.4,332.3,209.5,368.4,49,36,28,30,38,35,28,46,29,51,5,3,5,4,7,5,6,2,2,0,4,6,5,6,3,0,3,6,5,1,1,2,3,1,5,2,2,2,1,3,0,3,0,1,6,3,0,2,2,0,1,6,3,2,6,2,3,3,3,3,9,4,3,3,3,1,3,0,2,4,5,2,0,4,8,2,1,6,2,2,3,0,0,1,4,2,5,4,4,0,0,5,1,2,3,0,1,4,10,2,2,3,8,3,4,6,0,3,2,2,4,5,4,2,1,1,2,3,5,5,4,5,7,2,7,4,5,2,2,3]
["Camden",39.9,"Stable",7.5,0.73763215329999998,80,302.3,274.10000000000002,300.60000000000002,364.8,374.7,325.39999999999998,269,256.60000000000002,241,337.2,224,220,262,343,380,365,323,328,308,431,19,11,9,17,16,20,24,17,18,33,33,7,14,17,16,21,25,21,19,13,29,18,14,13,6,19,13,27,22,31,31,20,21,14,34,24,29,35,28,25,16,31,46,39,18,28,22,26,22,21,35,33,38,29,43,40,42,28,27,22,28,32,21,28,48,30,31,30,44,28,21,24,16,38,26,25,24,30,42,16,26,27,23,30,29,26,27,34,30,23,30,33,36,17,22,21,33,28,29,27,29,23,34,23,29,15,21,17,32,34,38,36,35,31,29,38,41,50,27,40]
["Campbelltown","Stable",7.3,2.9,1.5025635599,39,605.29999999999995,553.29999999999995,530.20000000000005,502,539.5,532.6,555.20000000000005,523.4,555.5,686.9,960,894,873,843,922,934,987,944,1002,1239,68,73,80,83,103,85,100,73,85,76,59,75,63,63,67,63,85,81,102,86,96,62,83,43,88,71,83,46,100,72,80,77,66,60,65,65,41,42,62,82,71,94,88,70,67,81,69,76,79,84,67,76,69,105,81,78,76,66,78,63,46,76,76,86,80,88,119,75,85,54,63,86,84,70,70,75,100,100,93,84,65,102,68,76,69,48,62,81,107,88,78,81,97,83,72,78,74,114,93,85,86,89,92,91,82,71,61,64,74,79,102,98,95,121,124,106,136,121,98,85]
["Canada Bay","Stable",10.199999999999999,3.7,0.43398382070000002,108,141.5,134,110.4,116.8,104.1,130.9,141.6,164.8,195,198.4,128,124,104,111,100,120,127,147,174,177,7,12,13,11,19,14,5,10,10,6,8,13,11,12,13,11,12,10,10,5,16,7,8,9,4,10,7,16,5,11,7,8,12,10,7,7,11,6,8,13,13,10,10,3,11,12,6,8,13,2,8,14,4,11,7,11,7,9,10,4,13,12,4,10,13,11,8,5,10,19,7,8,10,20,11,8,7,8,12,5,16,17,5,8,13,4,8,7,17,19,20,6,10,23,10,10,9,9,16,8,12,19,17,20,14,17,18,15,19,12,13,9,10,17,13,15,21,16,16,16]
["Canterbury-Bankstown",17.600000000000001,9.6,3.1,1.0623117354,61,384.2,391,363.2,298.5,316.5,333.3,384.7,347.3,412.8,485.7,1369,1415,1338,1115,1196,1253,1433,1292,1536,1807,121,112,91,137,129,113,136,114,117,107,98,94,118,126,99,123,138,133,86,116,142,109,111,114,105,115,90,118,114,124,160,103,112,91,115,91,81,87,111,111,91,106,91,76,92,84,76,109,110,91,96,98,92,118,128,78,102,83,103,97,87,109,98,113,97,119,114,98,100,94,91,133,120,118,109,121,130,134,113,99,108,121,160,100,95,85,120,126,131,106,103,105,120,110,104,87,140,101,122,108,116,152,147,139,134,106,112,159,143,110,165,148,156,167,151,130,166,168,161,142]
["Carrathool","n.c.","n.c.","n.c.",".","n.c.","      . ","      . ","      . ","      . ","      . ","      . ","      . ","      . ","      . ","      . ",14,13,9,7,14,11,26,19,15,18,0,1,1,1,0,0,1,5,1,3,1,0,1,1,3,2,0,1,1,2,1,0,0,1,0,0,1,2,1,0,1,0,1,1,1,1,1,1,0,2,0,1,2,0,0,0,0,0,4,2,0,0,1,0,4,2,1,0,0,0,0,0,0,0,0,5,1,0,2,0,2,1,2,2,2,2,3,4,0,1,3,1,5,1,2,0,0,0,6,2,1,3,3,0,1,1,0,1,0,3,1,4,0,1,1,0,2,2,1,2,0,1,3,2,0,0,1,5,1,2]
["Central Coast","Stable",2.5,2.7,1.0962540385999999,60,413.5,488.4,495.3,496.1,458.5,456.4,411.8,464.5,497.5,501.2,1378,1644,1681,1695,1577,1584,1435,1622,1737,1750,99,108,101,109,126,137,135,111,129,122,86,115,103,124,85,145,136,152,161,173,152,147,123,143,114,132,138,148,159,168,162,155,155,143,111,96,103,122,123,142,152,183,166,127,154,169,122,132,105,134,129,123,127,181,185,125,151,119,99,99,136,131,140,155,116,175,155,138,126,106,91,115,109,129,108,144,115,162,132,111,121,96,100,108,111,129,99,133,149,167,161,117,154,150,118,134,122,130,122,178,135,167,174,150,148,160,118,133,133,153,128,157,167,157,153,162,167,120,136,117]
["Central Darling",41.5,"Stable","Stable",".","n.c.","      . ","      . ","      . ","      . ","      . ","      . ","      . ","      . ","      . ","      . ",117,100,77,82,94,103,100,102,94,133,5,2,19,19,10,16,12,11,11,0,5,7,1,11,11,9,9,14,14,0,5,7,3,16,6,1,4,10,8,13,4,4,10,8,3,6,9,5,6,8,10,13,14,3,3,2,7,2,11,16,10,12,5,4,3,5,12,8,5,3,9,12,7,16,11,9,10,6,7,4,2,10,9,7,8,6,5,11,8,9,8,10,11,8,12,14,7,9,7,11,15,5,5,6,4,7,7,5,7,4,11,1,7,8,13,14,7,10,14,10,7,5,14,19,10,12,11,10,14,7]
["Cessnock",24.8,17.3,"Stable",1.6202917772000001,31,649.5,670,618.5,589.5,495.2,414.1,500.6,438.7,593.5,740.8,363,380,356,348,297,258,321,289,391,488,27,21,30,34,33,32,30,39,41,19,33,24,26,30,31,29,44,44,30,29,34,29,23,31,27,28,23,42,25,37,31,28,36,31,19,29,31,14,32,36,34,36,28,25,33,33,16,30,22,23,25,28,17,28,17,32,31,41,18,15,14,31,19,26,26,27,10,15,22,17,19,32,23,27,21,18,26,32,45,28,26,29,20,26,28,21,12,19,18,30,40,36,32,23,9,21,19,32,39,24,32,33,36,34,38,37,23,44,38,62,45,42,39,35,41,31,48,40,25,42]
["Clarence Valley","Stable",19.600000000000001,7.3,1.540596914,35,397.7,435.9,401.2,457.4,391,356.2,426.1,398.8,572.6,704.3,205,225,207,236,202,188,231,218,313,385,11,18,11,22,21,20,18,19,14,22,17,12,16,20,18,21,20,20,28,16,21,11,20,14,12,22,14,17,21,26,20,23,15,8,14,15,16,14,25,23,19,36,24,16,17,12,12,22,12,25,14,17,18,25,27,12,6,17,14,15,10,10,14,19,17,22,21,24,13,13,8,17,8,15,21,24,20,34,16,16,19,19,17,22,20,18,13,12,15,15,26,11,25,21,19,23,27,27,20,25,28,23,37,23,23,25,24,31,34,31,28,28,49,43,36,29,30,33,25,19]
["Cobar","Stable","Stable","Stable",1.6759058899999999,26,813.5,900.5,633.70000000000005,487.8,809.3,523.1,536.79999999999995,593.20000000000005,716.8,766.2,39,43,30,23,37,22,22,24,29,31,6,1,1,4,5,2,4,4,3,6,1,2,5,3,4,2,6,1,3,4,3,3,4,5,3,1,2,2,1,3,4,3,5,1,4,1,1,0,0,0,2,2,5,5,4,3,0,1,2,3,1,5,2,7,1,3,4,3,3,3,1,3,2,3,1,1,1,1,5,2,0,2,0,5,0,2,2,0,3,1,1,0,7,1,2,2,1,0,2,1,0,4,4,1,4,3,1,2,2,4,1,5,1,2,1,2,3,5,5,5,1,3,3,0,2,2,3,0,3,4]
["Coffs Harbour","Stable",12.4,4.8,2.0439748923000001,14,660.4,630.79999999999995,640.6,660.3,547.5,595.6,729.9,669.8,863,934.5,487,471,484,505,423,466,575,534,688,745,33,37,40,25,45,74,68,32,33,29,42,29,25,38,25,45,37,45,50,41,44,36,48,37,45,56,35,31,42,46,54,43,39,34,29,30,36,34,32,39,45,60,47,44,52,37,38,41,39,30,34,32,41,41,38,32,36,28,36,36,35,40,30,36,38,57,44,34,50,32,38,32,46,57,51,52,51,42,62,37,45,36,45,51,41,39,32,37,41,52,51,64,54,31,44,48,45,38,75,75,37,40,69,58,76,48,64,63,69,57,55,62,61,92,76,52,59,63,60,39]
["Coolamon","n.c.","n.c.","n.c.",0.73482446599999995,81,274.89999999999998,227.8,432.6,229.2,207.3,250.2,295.3,224,156.80000000000001,335.9,12,10,19,10,9,11,13,10,7,15,1,0,0,3,3,1,2,0,0,1,1,0,1,0,2,2,0,2,0,0,0,1,1,1,4,0,1,4,0,0,2,0,2,2,3,1,0,0,1,1,2,1,1,1,0,0,2,1,0,2,0,0,0,4,2,0,0,0,1,0,0,2,2,0,1,2,0,1,1,0,1,1,0,2,0,2,1,1,1,1,1,1,1,2,1,0,1,0,0,1,1,1,0,1,4,0,0,2,1,1,0,0,1,0,0,1,0,1,0,0,3,0,1,0,1,1,2,1,2,4]
["Coonamble","Stable",-12.4,5.3,4.1745073739,3,1124.4000000000001,1530.5,1065.4000000000001,1372.3,2400.8000000000002,3208.3,2243.6999999999998,1803.9,1725.5,1908.5,46,62,43,55,95,124,86,69,66,73,2,3,1,4,1,13,1,2,3,8,1,7,5,4,4,6,9,3,8,2,2,7,6,6,3,2,3,2,3,4,2,4,6,5,1,8,5,2,4,8,6,2,7,5,2,2,6,6,4,5,3,8,2,16,10,10,8,4,8,17,5,5,14,13,13,12,16,7,18,6,12,3,4,6,9,8,6,3,6,13,5,6,10,10,11,8,5,7,9,6,5,2,7,5,2,2,5,4,4,6,4,13,11,3,6,4,4,2,4,10,5,5,4,10,5,4,9,8,4,5]
["Cootamundra-Gundagai","Stable","Stable","Stable",1.2659033198,50,460.1,460.5,435.6,515.6,641,466.1,465.3,447.2,657.7,578.70000000000005,52,52,49,58,72,53,53,51,75,66,4,7,5,3,2,5,7,4,3,4,3,5,2,7,2,6,7,5,1,4,6,4,4,4,2,4,6,2,8,3,3,2,9,9,0,1,7,2,5,6,9,3,6,1,4,5,6,4,3,7,7,6,12,5,3,4,4,7,5,9,6,4,1,2,3,5,7,5,2,7,5,6,3,7,8,7,4,3,5,6,3,2,2,3,4,4,3,1,5,9,3,3,2,10,2,5,4,7,7,1,3,11,6,12,8,3,6,7,4,6,5,10,9,4,7,5,5,6,1,4]
["Cowra","Stable","Stable","Stable",1.2051391150999999,54,610.9,663.6,440.9,494,478.8,518.9,634.79999999999995,795,684.8,551,77,84,56,63,61,66,81,101,87,70,9,5,6,2,3,10,9,7,3,12,8,3,8,3,7,10,3,6,13,7,10,9,7,1,1,3,1,3,10,8,8,2,5,2,3,10,4,6,2,3,5,14,5,2,9,3,5,5,5,0,7,5,4,6,6,7,2,6,8,5,0,9,2,3,3,12,4,6,5,4,8,10,5,10,4,11,10,7,10,5,2,1,8,8,5,6,9,10,6,10,14,15,8,7,8,3,7,11,5,7,10,6,10,2,7,11,3,8,6,7,9,5,2,3,9,7,3,6,8,5]
["Cumberland",17.399999999999999,"Stable",1.6,1.0253961336999999,64,437.7,404.5,359.5,366.4,375.6,424.3,436.6,361,399.3,468.8,968,913,833,867,907,1020,1035,857,948,1113,74,80,101,100,63,100,94,74,78,71,73,60,67,58,65,63,123,82,87,70,92,67,69,70,85,51,64,78,67,66,92,77,71,46,56,80,56,54,75,68,60,102,94,82,73,69,72,62,58,64,74,71,81,94,88,69,66,80,68,94,58,87,78,66,71,100,104,96,101,70,90,99,84,55,89,96,81,110,85,89,84,77,89,96,86,40,37,62,64,72,97,84,82,72,77,84,94,93,66,77,72,72,86,78,89,67,73,81,83,85,90,85,100,96,97,92,113,107,87,78]
["Dubbo Regional","Stable","Stable",5.6,2.7823913982000001,6,859.4,807.3,755.8,776.8,1254.9000000000001,1209.3,1084.0999999999999,1232.7,1084.2,1272.0999999999999,437,415,394,413,674,664,602,689,606,711,33,32,31,44,44,51,53,29,33,31,34,22,21,26,39,37,53,43,38,29,34,31,27,37,28,28,26,39,45,42,32,29,29,26,42,28,21,22,29,28,33,27,45,42,45,48,42,31,36,46,58,71,58,50,74,44,82,45,51,59,28,69,46,64,67,68,88,61,47,29,53,44,38,54,59,45,65,48,57,36,45,63,47,45,45,48,59,42,38,84,58,60,70,47,78,60,43,36,59,56,55,48,46,68,54,55,50,36,50,52,55,62,67,67,74,63,64,60,56,41]
["Dungog","Stable","Stable","Stable",0.71995967709999997,86,366.3,252.7,271.89999999999998,321.3,286.60000000000002,265.2,304.2,349.7,360,329.2,33,23,25,30,27,25,29,34,35,32,0,2,2,4,0,4,6,7,3,1,1,3,3,4,0,1,1,1,1,1,4,4,1,2,1,0,4,3,2,1,1,4,0,2,5,2,1,0,1,4,4,1,0,2,8,1,6,2,1,2,3,0,5,1,3,2,2,3,2,3,1,0,0,0,2,0,6,1,6,0,3,6,1,1,6,1,4,1,4,4,3,2,0,2,1,3,4,1,3,1,6,6,3,2,3,1,1,10,0,0,2,5,5,2,5,1,2,2,4,3,3,2,1,3,6,3,2,1,1,3]
["Edward River","Stable","Stable",7.2,1.8880797807,19,432.8,622.79999999999995,502.5,478.6,616.5,703.2,782.3,827.7,839.5,863.2,39,56,45,43,56,60,66,70,71,73,3,3,7,4,7,3,2,1,3,2,4,0,5,5,5,2,4,4,11,9,3,3,2,3,7,3,2,2,9,6,4,4,5,2,1,0,0,5,9,0,2,5,7,3,3,3,3,3,7,5,1,7,7,6,7,1,4,1,7,3,6,2,2,8,10,6,6,8,2,4,3,3,4,8,3,5,1,10,6,7,6,7,5,4,1,3,9,7,1,7,7,5,5,7,12,6,10,3,12,1,6,3,2,8,4,2,9,11,2,8,2,4,7,12,7,7,3,5,11,5]
["Eurobodalla","Stable",12.1,5.0999999999999996,1.3041849614000001,48,410.8,443,375.4,434,452.3,386.5,531.29999999999995,539.79999999999995,608.5,596.20000000000005,155,168,143,166,174,154,215,220,248,243,7,7,9,5,13,17,24,19,20,12,15,7,21,13,13,21,11,24,12,9,13,9,9,13,15,12,8,19,9,13,23,8,10,7,4,15,8,18,12,15,14,22,19,16,12,5,13,12,13,11,17,16,18,26,14,12,9,11,13,14,12,14,5,8,13,10,11,19,11,17,18,16,8,22,19,13,15,25,21,16,7,16,31,22,12,21,19,10,15,32,37,12,19,7,16,20,13,20,16,28,12,25,22,19,19,27,20,27,18,21,23,25,19,16,23,20,19,30,17,12]
["Fairfield","Stable",4.9000000000000004,1.7,0.97199512919999997,70,388.2,381.2,328.8,339.3,367.6,358.4,375.5,405.7,443.4,444.4,790,784,686,714,778,759,785,839,917,919,49,72,46,87,72,66,63,79,68,53,77,58,58,66,68,78,58,81,70,61,63,47,75,59,47,47,65,63,54,84,60,41,60,52,65,48,75,54,53,63,64,91,65,41,48,56,43,61,55,50,69,61,70,86,91,73,65,55,55,48,56,63,68,55,54,74,60,61,69,52,71,76,44,41,70,74,66,85,57,74,62,69,54,89,47,66,50,67,87,76,75,83,71,70,68,79,94,85,78,77,63,68,66,87,93,56,75,75,80,78,75,72,74,102,90,84,72,79,63,50]
["Federation","Stable","Stable","Stable",0.90188546110000001,75,312.8,313.39999999999998,224.9,216.9,201,362.1,296.39999999999998,171.2,342.3,412.3,39,39,28,27,25,46,38,22,44,53,4,4,5,2,1,7,1,2,5,1,3,4,8,0,4,4,1,4,5,2,4,0,5,2,3,0,5,1,3,1,1,4,4,4,1,1,3,2,2,1,2,7,0,1,1,3,3,2,2,2,2,2,1,2,3,1,6,2,0,2,3,3,6,3,3,4,5,3,5,5,4,2,4,3,0,2,5,2,3,4,6,6,2,1,0,2,1,3,1,0,3,2,3,3,2,2,2,8,4,0,4,11,3,4,4,1,2,1,4,2,3,1,4,3,3,1,4,6,8,14]
["Forbes","Stable",-8.6999999999999993,"Stable",1.3818644623,45,851.3,865.8,648.79999999999995,545.6,848.1,896.2,777.8,663.9,771,631.79999999999995,83,85,64,54,84,85,73,62,72,59,4,5,5,5,10,8,6,11,11,9,5,4,3,5,3,7,13,8,8,15,7,4,7,5,8,6,7,6,5,3,6,4,8,3,6,2,4,8,2,5,3,7,8,2,4,5,5,1,6,8,8,7,8,8,9,8,8,5,6,3,2,4,9,8,11,6,8,4,9,5,11,8,7,4,7,6,3,10,7,5,4,7,9,4,9,10,7,2,4,6,4,6,3,3,1,7,7,8,2,4,9,4,15,3,9,6,4,1,0,4,8,5,5,11,3,9,4,2,2,6]
["Georges River","Stable",-6.3,"Stable",0.52816067970000002,102,262.8,293.2,294.7,236.9,296.10000000000002,307.89999999999998,292.5,281.89999999999998,306.7,241.5,397,449,461,375,472,479,447,432,470,370,45,26,25,33,30,29,38,37,40,30,32,32,35,39,38,38,41,29,39,33,57,36,27,37,32,40,40,23,31,49,45,48,58,34,25,36,21,32,31,39,35,39,42,25,29,25,27,30,29,58,35,35,23,74,45,41,36,33,41,22,43,42,42,59,42,47,46,36,35,26,30,31,28,31,53,39,44,48,30,28,38,30,40,38,43,32,31,42,32,48,22,34,55,29,36,28,37,47,31,27,46,56,28,46,44,26,32,50,33,27,27,26,21,40,27,37,41,29,27,35]
["Gilgandra","Stable","Stable","Stable",1.8316768964000001,20,898.2,581.70000000000005,1035.5,710.7,1179.5,879.4,1320.1,744.4,977,837.4,39,25,44,30,50,38,57,32,42,36,5,0,3,4,2,5,2,5,2,3,4,4,3,0,1,3,4,1,3,2,3,0,1,4,7,5,3,2,1,2,4,1,3,10,3,3,3,3,3,1,3,3,2,4,2,2,0,4,1,6,2,4,5,5,9,2,9,0,4,3,1,1,0,5,3,5,8,5,4,0,2,4,4,1,8,4,4,6,5,11,6,1,3,4,4,3,0,3,7,1,2,2,4,1,1,4,4,2,7,1,4,3,3,3,5,4,5,1,7,1,2,1,3,2,6,5,2,2,2,3]
["Glen Innes Severn","Stable","Stable","Stable",1.7361682734999999,25,1109.0999999999999,850.7,1087.0999999999999,786.5,642.70000000000005,672,862.7,659.6,838.5,793.7,99,76,97,70,57,60,77,59,75,71,7,9,9,12,9,5,13,7,4,7,5,12,2,1,5,12,7,1,9,4,13,10,6,6,6,12,15,6,11,8,6,2,10,7,8,6,7,2,3,10,4,9,12,6,5,2,2,8,5,4,2,3,3,4,9,4,5,3,10,5,3,1,5,3,11,6,9,1,4,10,5,2,8,6,10,7,8,3,14,3,3,5,2,8,6,9,7,1,4,3,7,6,5,4,1,6,6,5,6,5,7,5,3,4,12,7,5,10,8,7,8,5,7,6,6,4,5,7,6,2]
["Goulburn Mulwaree","Stable",12.7,5.5,1.3490363228,46,415.9,403.2,350,415.3,340.5,389.1,419.9,379.3,552,616.79999999999995,124,122,107,128,106,124,135,123,179,200,10,10,10,11,8,12,14,6,8,15,9,11,13,9,9,14,7,10,13,8,9,15,5,10,7,9,8,2,12,7,4,13,16,9,10,10,14,7,10,15,8,11,19,19,7,5,6,7,7,11,5,5,9,16,11,9,7,8,7,11,10,10,16,7,6,12,16,14,6,8,14,5,9,9,8,6,20,18,16,5,19,9,5,11,16,9,4,7,5,9,13,13,13,15,10,9,16,7,15,17,21,15,19,15,11,13,17,13,20,15,21,14,17,19,8,22,10,15,25,14]
["Greater Hume Shire","Stable","Stable","n.c.",0.60182082459999997,99,220.3,114.1,216.8,196.7,250.9,275,288.10000000000002,292.89999999999998,337.3,275.10000000000002,23,12,23,21,27,30,32,33,38,31,2,3,2,1,3,4,1,0,3,2,1,1,0,0,4,0,2,1,3,0,0,0,0,2,2,0,4,0,3,4,3,2,0,2,2,1,1,0,2,2,1,2,6,2,1,1,0,3,1,2,1,1,2,1,5,2,2,4,3,3,0,1,1,1,5,4,5,1,2,2,3,5,0,5,3,2,1,2,5,6,1,3,1,3,4,2,3,2,1,2,3,0,4,7,2,3,3,3,3,6,3,4,3,4,1,2,5,1,2,8,1,3,2,4,3,6,1,1,0,0]
["Griffith","Stable","Stable","Stable",1.6679849846000001,28,833,1035.8,804.3,756.1,777.1,860.5,698.7,655.20000000000005,851.4,762.6,218,273,214,203,210,234,190,177,230,206,12,13,24,11,22,22,21,17,25,16,21,14,29,32,19,18,22,23,27,13,22,23,23,22,15,14,23,24,20,16,13,23,17,24,14,11,17,18,16,16,19,24,14,17,7,25,19,11,31,12,11,10,17,23,21,21,16,16,11,21,8,19,22,21,18,29,26,17,31,16,7,20,17,15,14,13,18,28,23,11,13,9,12,17,17,14,23,15,18,19,15,9,16,14,10,7,15,18,27,19,16,13,19,21,25,14,20,23,10,13,19,10,22,23,21,16,18,16,18,20]
["Gunnedah","Stable","Stable",7,1.980310193,17,522.20000000000005,392.3,683.2,522,473.2,761.5,657.1,798.8,852.1,905.4,65,49,86,66,60,99,86,105,112,119,10,2,10,1,5,6,6,6,4,4,6,5,5,3,2,4,4,8,5,6,7,1,0,4,3,4,7,8,24,8,4,7,9,5,1,6,2,2,5,6,8,7,10,11,6,2,3,4,3,5,4,7,3,7,9,3,5,5,4,5,5,12,3,15,8,10,9,7,6,7,2,15,7,6,1,9,11,15,6,4,7,11,6,3,7,4,10,8,10,14,11,10,15,5,6,5,12,11,9,7,8,11,6,8,15,9,8,8,8,15,8,4,13,14,12,7,14,7,10,7]
["Gwydir","n.c.","n.c.","n.c.",1.599183383,32,245.2,394.3,263.3,355.5,560.5,598.79999999999995,386.8,182.8,243.7,731.1,13,21,14,19,30,30,19,9,12,36,0,2,3,0,2,1,1,2,1,1,0,0,2,0,0,2,3,3,3,2,1,3,2,0,0,1,0,2,0,1,1,1,1,2,4,1,2,1,0,3,1,2,1,4,0,1,3,1,0,6,4,1,1,5,3,1,2,4,1,2,0,2,2,1,0,2,8,1,3,6,1,4,0,2,3,2,4,0,1,1,5,0,1,0,0,0,1,0,0,2,0,1,2,2,1,0,1,1,2,1,1,1,2,0,1,0,0,2,2,1,1,2,5,8,4,2,2,1,4,4]
["Hawkesbury","Stable",5.9,"Stable",1.0185309718,65,411.3,429.6,361.5,400,347.8,372.1,356.5,406.7,459.8,465.7,271,285,241,268,234,251,241,276,312,316,18,18,30,20,23,30,32,22,18,24,16,20,21,21,26,26,26,23,19,25,27,27,24,20,20,15,17,20,20,24,21,17,16,30,28,13,16,13,21,25,22,27,21,21,38,25,20,19,21,19,19,13,12,17,24,16,21,23,23,26,20,15,15,21,16,16,24,21,21,22,21,39,17,21,16,29,23,27,11,25,19,15,18,20,21,17,19,26,24,32,37,10,26,22,20,22,22,23,22,28,26,28,20,19,38,32,25,29,20,18,14,29,23,41,23,26,37,15,30,40]
["Hay","n.c.","n.c.","n.c.",".","n.c.","      . ","      . ","      . ","      . ","      . ","      . ","      . ","      . ","      . ","      . ",22,19,20,14,20,24,23,28,21,19,2,5,0,1,4,2,0,2,0,1,0,5,0,0,1,0,1,1,2,1,3,6,3,1,1,1,3,1,1,1,3,0,1,3,3,2,1,1,0,0,2,1,0,5,1,2,1,0,1,2,2,0,2,3,0,0,0,4,4,2,0,4,3,1,3,0,1,4,3,2,1,2,2,1,7,5,0,0,4,2,1,0,0,1,0,1,5,3,7,1,2,2,3,1,0,3,1,2,1,1,3,0,3,1,4,0,2,3,1,0,3,1,0,3,2,2,3,1,3,0]
["Hilltops","Stable","Stable",3.5,1.5007392754,40,517.1,447.9,431.7,581.1,502.6,495.7,556.6,701.7,639.29999999999995,686.1,97,84,81,109,94,95,107,135,123,132,7,8,9,13,12,12,10,8,5,2,6,5,6,6,4,11,6,11,11,7,8,6,3,5,3,4,8,8,3,6,15,9,7,10,2,6,5,9,6,9,10,12,12,6,12,6,11,11,3,9,7,11,11,10,10,5,7,9,11,1,6,10,7,13,6,6,12,7,6,4,13,5,2,7,4,20,10,10,10,16,4,7,5,12,9,7,3,12,10,14,16,17,9,10,13,15,12,10,1,5,11,6,17,19,8,13,5,16,25,10,6,9,7,11,16,12,8,12,8,8]
["Hornsby","Stable","Stable",3.5,0.347384743,113,121.1,99.7,110.6,94.3,132.19999999999999,156.80000000000001,173.4,150.30000000000001,149.6,158.80000000000001,177,147,165,142,201,241,264,228,227,241,20,16,14,7,11,15,15,6,14,27,15,17,8,5,13,15,12,21,13,18,15,6,6,15,14,13,12,11,17,12,15,18,20,15,12,6,14,13,16,9,7,13,8,11,8,11,16,16,25,11,8,17,9,19,21,21,21,16,19,14,19,23,11,12,27,13,28,23,20,17,17,31,21,31,27,18,16,21,20,15,23,16,35,21,24,18,17,19,13,19,20,18,12,21,26,21,13,17,22,17,25,14,21,21,18,19,16,24,19,21,19,19,14,18,20,20,28,16,19,28]
["Hunters Hill","n.c.","n.c.","n.c.",0.21992663679999999,119,75.7,102.3,149.1,134.19999999999999,160.30000000000001,143.4,139.69999999999999,86.2,114.9,100.5,11,15,22,20,24,20,19,12,16,14,1,0,0,2,2,1,2,1,0,0,2,0,2,1,1,2,3,0,2,3,1,0,0,0,2,2,1,2,2,0,1,3,1,1,3,4,1,0,2,3,1,2,2,4,2,1,1,1,2,1,2,0,2,0,5,0,3,4,3,2,1,1,0,2,0,3,1,4,3,1,3,1,1,2,1,1,0,1,0,4,2,2,4,1,1,0,1,0,0,2,2,0,0,1,2,3,1,1,2,1,2,2,1,2,0,2,1,1,1,1,0,3,0,1,2,1,2,1,2,0]
["Inner West","Stable",5.3,"Stable",0.64387620170000004,96,265,247.9,216.7,197.1,197.8,231.5,236.6,245.8,287.3,294.39999999999998,500,474,422,390,397,439,435,450,526,539,41,40,44,32,46,45,49,37,48,41,36,41,35,40,29,40,53,42,40,38,50,40,37,30,32,29,27,38,25,43,40,35,45,40,39,29,27,36,31,44,26,35,29,39,28,33,34,28,24,38,27,20,34,43,44,36,37,29,24,41,29,42,31,42,33,42,44,32,29,49,38,28,18,39,31,32,32,47,39,35,44,48,36,34,33,32,31,29,52,46,37,25,37,37,55,36,33,41,53,56,43,39,51,43,53,42,47,25,52,41,52,36,56,61,31,44,59,36,35,36]
["Inverell","Stable",5.7,5.9,2.4958373384999999,10,729.2,779.2,540.79999999999995,677.6,924.4,913.5,904,1118.8,1185.5999999999999,1141,122,131,91,114,165,164,162,201,213,205,10,6,16,5,21,13,9,4,5,11,14,8,16,17,7,8,14,10,15,4,15,12,7,6,7,8,4,11,8,10,9,11,7,5,4,7,7,6,9,13,10,11,9,16,11,11,4,7,8,10,10,12,18,10,28,18,13,6,13,19,10,10,20,10,12,26,24,14,7,4,17,10,12,17,9,13,8,19,14,11,15,16,16,12,16,19,18,22,20,15,13,16,20,15,11,16,22,8,20,18,19,23,23,12,14,14,30,10,11,11,11,21,17,25,16,19,18,17,14,25]
["Junee","n.c.","n.c.","n.c.",0.98116778530000004,67,473.5,701.6,291.60000000000002,196.2,493.8,465.2,495.8,340.3,232,448.6,30,45,19,13,33,30,32,22,15,29,2,0,0,1,2,1,7,1,6,1,5,4,3,1,3,4,1,6,1,5,7,3,4,7,3,3,2,1,3,2,2,1,0,2,0,0,0,1,0,0,1,3,4,2,0,0,1,1,2,4,0,2,1,0,6,4,2,5,2,5,0,2,1,4,2,3,7,2,0,8,0,1,0,2,1,1,2,4,5,3,5,4,2,3,3,4,2,3,1,1,1,3,0,1,1,2,0,3,0,0,1,1,3,1,3,1,0,2,0,3,3,4,2,2,3,1,4,3,0,4]
["Kempsey","Stable",15.9,4.5999999999999996,2.5465037853000001,9,827.1,791.7,751.3,755.9,786.8,658.1,934.2,782.6,1112.9000000000001,1164.2,243,233,222,224,234,201,288,244,347,363,7,16,20,25,20,27,22,22,21,21,26,16,8,18,16,23,29,23,20,27,14,13,16,26,17,19,14,31,17,15,25,15,18,22,9,20,18,11,17,25,19,20,25,26,26,17,12,8,14,25,18,19,25,26,20,18,18,13,14,24,23,10,12,23,13,23,20,18,18,17,15,9,12,14,27,24,38,33,31,31,21,10,22,25,23,15,21,12,21,27,36,21,11,15,24,18,25,24,23,21,38,39,40,26,31,19,34,27,24,20,29,38,29,32,41,38,27,29,33,23]
["Kiama","Stable","Stable","Stable",0.2667007918,115,178.2,153.80000000000001,129.1,139.19999999999999,136.9,96.4,209,121.9,130.6,121.9,39,34,29,32,32,22,48,28,30,28,1,5,1,3,6,4,3,3,7,2,1,3,1,4,3,4,4,4,3,2,2,4,1,2,2,1,2,3,2,0,2,3,4,5,1,4,2,4,0,1,3,5,6,2,2,3,1,3,5,0,3,3,5,3,4,1,6,0,1,1,3,1,1,0,5,0,2,2,2,1,3,2,2,2,15,3,3,1,7,2,3,2,5,3,2,1,1,4,3,5,3,0,2,1,4,2,4,0,2,4,2,4,2,3,2,3,2,2,3,4,4,2,0,4,1,0,4,3,1,2]
["Ku-ring-gai","Stable","Stable",7.1,0.25718343430000001,117,65.099999999999994,67.8,57,56.4,70,107,129.1,93.4,108.7,117.6,79,83,71,71,89,135,161,116,135,146,3,11,8,14,6,5,1,5,7,7,8,4,10,3,4,8,10,8,8,6,7,8,6,5,9,5,7,4,9,2,9,8,5,3,5,5,5,1,9,9,4,8,3,6,6,5,8,7,7,4,5,3,9,14,10,8,4,8,9,8,13,10,10,7,14,3,9,7,20,9,23,10,13,6,10,13,23,8,15,6,13,16,19,19,9,8,8,10,14,10,9,10,12,7,11,8,16,12,14,8,12,8,8,13,11,19,4,10,7,10,19,13,15,7,11,17,11,10,10,16]
["Kyogle","Stable","Stable","Stable",0.90242010220000002,74,402.3,373.1,389.7,519.1,534.29999999999995,269.2,353.1,349.1,338.5,412.6,37,34,35,46,47,25,33,33,32,39,5,5,5,2,3,1,4,1,3,0,2,6,2,3,9,1,2,1,3,6,1,4,2,0,2,1,0,7,9,2,4,2,1,2,1,4,1,3,4,3,7,10,6,1,2,6,0,3,4,7,2,2,2,11,2,2,5,2,4,4,3,2,0,0,3,3,4,2,2,3,0,3,4,3,2,5,2,2,4,2,2,2,3,2,2,4,2,3,6,0,5,2,2,0,6,1,0,2,5,2,6,1,6,4,3,2,1,0,2,2,4,2,7,4,2,2,3,3,4,4]
["Lachlan","Stable","Stable","Stable",2.9929224544999999,5,1193.8,739.5,1268.0999999999999,846.5,1071.4000000000001,982.4,715.1,814.5,879.6,1368.3,77,47,79,52,66,61,44,50,54,84,6,4,0,7,7,10,8,4,4,7,12,8,4,2,4,2,3,5,7,8,4,3,2,3,7,5,8,6,6,4,5,4,8,4,13,9,3,1,4,2,7,8,8,10,4,1,3,1,7,8,9,6,1,8,6,4,2,3,3,9,6,8,10,7,3,6,3,3,2,5,4,4,4,6,8,3,3,5,4,2,3,3,0,3,4,1,4,3,4,6,3,7,7,3,6,2,6,2,5,9,2,2,2,8,4,2,8,4,9,6,7,11,10,6,6,7,4,6,9,3]
["Lake Macquarie",10.5,"Stable",2.4,0.9118787491,72,361.8,364.7,399,365.4,368.7,373.9,371.4,380.9,377.2,416.9,728,738,812,748,759,791,795,825,817,903,47,54,57,58,82,64,98,52,68,45,63,40,47,81,61,65,62,67,65,63,61,59,60,47,54,56,60,60,74,82,85,65,65,67,73,71,47,67,51,62,77,80,80,58,62,63,61,40,53,55,70,55,67,78,77,61,66,67,42,68,68,56,80,71,70,85,76,49,67,59,59,51,43,58,58,67,77,83,79,65,75,69,64,57,66,59,41,79,84,78,75,80,87,68,57,51,52,56,58,77,77,79,83,61,70,65,72,67,62,78,58,69,83,97,58,87,73,68,97,73]
["Lane Cove","Stable",12.3,9,0.42571999329999999,109,98.9,98.2,95.4,91.3,117.1,122.5,108.6,144.69999999999999,162.19999999999999,194.6,36,37,37,36,47,49,43,58,65,78,1,1,3,4,4,6,3,1,4,3,3,3,3,5,3,1,2,0,7,2,4,3,2,5,3,1,9,2,1,6,3,0,2,2,5,3,4,4,4,4,1,2,6,2,5,1,0,3,5,3,3,3,6,5,9,2,1,4,4,2,2,3,0,1,5,3,9,5,3,6,7,5,1,6,9,2,3,7,3,0,1,3,5,3,4,4,5,3,4,1,7,9,4,9,3,5,4,6,7,3,5,7,10,7,3,5,5,3,7,7,5,11,2,7,8,10,5,7,6,3]
["Leeton",13.8,"Stable",5.3,2.0433389370000001,15,587.20000000000005,526,490.2,682.7,734,879.6,801.4,811.9,820.7,934.2,67,60,56,78,84,101,92,93,94,107,1,7,2,8,8,7,3,5,7,9,5,5,5,3,3,7,7,9,4,7,7,2,4,2,7,4,3,7,4,6,5,8,3,5,4,0,6,3,7,7,8,7,7,8,6,5,6,8,10,8,6,2,4,9,5,8,5,13,5,9,12,6,12,8,8,12,7,8,4,9,9,6,6,7,4,8,9,6,14,5,11,10,5,7,10,4,10,8,8,8,12,5,13,5,8,2,6,6,10,11,6,6,11,10,7,7,7,7,7,7,7,9,10,10,11,11,9,7,11,8]
["Lismore","Stable","Stable","Stable",1.2251721440000001,53,520.20000000000005,462.4,359.7,431.5,487.6,416,628.9,528.5,499.1,560.1,230,204,158,189,213,184,279,234,221,248,23,21,19,21,17,23,19,11,14,14,34,14,21,9,18,18,13,24,14,17,20,20,13,17,7,13,18,9,13,16,19,21,10,7,10,15,14,7,19,16,20,17,21,8,12,18,17,20,17,19,26,11,22,27,17,17,16,10,16,15,15,15,18,10,22,18,27,6,8,11,17,17,9,22,30,18,28,21,26,29,21,15,35,25,19,13,23,17,24,33,21,9,18,27,17,13,18,10,15,21,22,18,19,24,25,14,22,13,12,11,25,18,12,23,22,30,18,20,32,25]
["Lithgow","Stable",13.7,7.2,2.0178104012999998,16,481.3,437.5,444.9,393.2,546.20000000000005,546.9,704.9,701.5,768.8,922.5,103,94,96,85,118,115,147,146,160,192,7,10,15,10,9,6,12,7,4,11,6,6,2,8,5,10,9,15,6,8,4,4,12,11,3,4,2,9,11,12,7,8,7,17,10,6,6,9,11,7,7,7,5,5,8,7,5,8,7,8,6,8,7,15,7,17,11,7,15,10,4,9,7,11,8,8,16,10,16,9,4,13,6,16,13,6,12,11,10,9,19,18,16,11,8,18,8,11,11,10,9,15,19,10,19,8,10,12,5,17,16,11,15,18,12,14,16,14,21,22,15,7,18,22,19,10,9,12,15,22]
["Liverpool",14.1,9.6999999999999993,4.2,1.2872803878000001,49,473.8,434,433.4,396.4,382.3,422.5,466.5,429.2,515.9,588.5,977,920,944,884,870,975,1094,1029,1237,1411,78,75,66,98,83,77,86,86,98,77,75,78,68,72,75,88,83,54,74,86,88,82,82,68,77,73,84,93,83,95,106,75,77,79,56,46,54,67,76,69,76,82,81,70,90,84,71,64,64,51,67,74,87,107,83,70,74,68,54,71,68,68,81,76,91,95,82,78,88,79,83,86,97,89,70,94,75,116,99,71,100,122,86,75,72,75,75,115,104,113,92,77,114,63,71,58,78,101,108,93,89,116,115,115,115,95,91,121,101,101,91,142,103,121,102,142,127,125,145,111]
["Liverpool Plains","Stable","Stable","Stable",1.2278731361999999,52,459.4,700.9,609.79999999999995,481.9,480.8,819.4,499.5,770.2,848.6,561.4,36,55,48,38,38,63,38,59,65,43,0,1,4,4,0,5,3,1,8,2,4,4,2,0,9,0,3,5,3,13,10,2,6,2,6,5,5,5,4,6,6,5,1,2,0,3,3,4,0,7,2,2,6,3,4,0,5,2,3,2,0,7,4,4,2,3,5,3,3,2,2,2,4,3,6,10,8,9,6,1,6,6,5,1,2,4,3,2,5,2,2,0,3,9,4,0,14,2,3,4,7,9,4,2,3,7,3,3,7,4,4,7,7,10,4,6,5,5,4,4,4,1,4,9,1,1,3,7,1,4]
["Lockhart","n.c.","n.c.","n.c.",0.97358790529999995,69,128.19999999999999,378.2,401.2,304,182.6,363.6,240.4,296.7,207.7,445.1,4,12,13,10,6,12,8,10,7,15,0,0,1,1,0,0,0,0,0,0,1,1,0,1,3,1,5,1,0,0,0,0,1,0,1,1,1,0,1,2,0,0,2,4,0,1,1,1,0,1,1,0,1,0,5,0,0,0,0,0,0,2,1,1,1,0,1,0,0,0,3,1,1,5,0,0,0,0,2,0,0,0,2,0,1,1,0,1,0,0,1,0,1,1,4,0,1,0,0,1,0,2,0,0,0,2,1,0,0,0,0,0,1,0,0,2,2,1,0,1,2,3,2,0,2,0,0,1,2,2]
["Lord Howe Island","n.c.","n.c.","n.c.",".","n.c.","      . ","      . ","      . ","      . ","      . ","      . ","      . ","      . ","      . ","      . ",0,0,3,0,0,1,18,0,3,7,0,0,0,0,0,0,0,0,0,0,0,0,0,0,0,0,0,0,0,0,0,0,0,0,0,0,0,0,0,2,1,0,0,0,0,0,0,0,0,0,0,0,0,0,0,0,0,0,0,0,0,0,0,0,0,0,0,0,0,0,0,1,0,0,0,0,0,0,0,0,0,0,0,0,0,0,0,0,0,0,0,0,0,18,0,0,0,0,0,0,0,0,0,0,0,0,0,0,0,0,0,1,0,2,0,0,0,0,0,1,0,6,0,0,0,0,0,0,0,0]
["Maitland","Stable",12.2,6.4,1.6612436422000001,29,527.29999999999995,636.20000000000005,536.70000000000005,588.4,529.6,511.8,473.4,582.20000000000005,684.7,759.5,408,503,435,489,451,449,429,545,641,711,28,41,25,25,31,34,31,24,37,40,58,34,26,43,34,35,65,43,44,47,53,32,36,45,45,41,23,40,51,39,44,41,33,32,21,25,31,32,39,42,57,47,49,42,39,44,44,23,36,42,26,39,43,59,43,47,31,35,14,36,29,37,31,45,38,46,47,41,47,28,37,23,35,31,41,36,27,41,35,35,47,24,47,30,27,51,43,38,32,41,38,55,37,53,61,69,41,49,46,46,62,58,82,54,48,60,45,50,65,65,49,57,49,87,55,58,75,53,38,60]
["Mid-Coast","Stable",6,4.8,1.4126738445,43,452.6,510.9,449.7,450.6,460.4,520.20000000000005,548.29999999999995,564.6,601.6,645.79999999999995,412,469,416,420,432,497,529,549,585,628,27,30,38,33,39,33,50,33,33,29,32,35,38,22,39,47,46,46,38,37,54,36,35,31,33,46,28,41,24,55,39,38,38,29,20,25,20,29,36,47,30,54,41,34,45,26,34,24,34,35,36,35,44,40,35,38,36,46,20,33,48,39,48,49,36,43,40,39,43,44,29,39,27,46,32,49,45,53,57,40,57,42,36,45,37,45,35,45,60,49,64,56,43,34,40,41,24,43,37,52,47,65,72,47,59,37,51,51,57,33,47,55,47,57,64,60,56,62,39,51]
["Mid-Western Regional","Stable","Stable","Stable",1.1108350521000001,59,521,484.8,463.2,490.9,586.20000000000005,673.5,548.29999999999995,624.20000000000005,600.9,507.9,127,119,115,123,148,172,141,161,155,131,6,6,11,5,21,10,15,17,9,9,8,10,11,10,11,7,5,11,6,14,7,10,10,17,12,8,9,9,7,14,7,11,7,11,12,8,8,8,8,10,8,10,14,13,15,7,12,10,8,11,8,8,5,18,19,13,20,12,15,11,18,14,10,13,13,8,19,26,15,13,13,10,3,8,17,6,12,17,10,13,10,15,13,17,10,14,12,12,15,20,9,16,13,10,14,16,17,13,7,10,14,23,18,12,13,12,11,5,16,14,2,7,16,13,6,9,17,13,9,9]
["Moree Plains","Stable",10.3,"Stable",4.7761211110000001,2,1878.4,1783.2,1857.2,1477.8,1402.7,1459,1920.7,2191.3000000000002,2028.1,2183.5,258,243,250,197,186,190,249,282,261,281,18,25,23,26,25,27,24,15,20,21,14,20,16,24,17,19,25,31,23,15,21,13,18,21,19,19,28,21,29,28,27,21,21,18,9,10,18,19,15,13,20,28,21,17,14,15,8,9,17,17,15,18,14,19,14,17,20,17,6,12,8,13,19,10,19,28,13,16,17,10,12,25,11,18,16,16,27,35,28,25,21,16,22,14,16,27,13,19,18,29,27,27,31,26,26,23,12,26,19,30,29,25,22,17,22,15,23,21,17,24,23,23,19,22,34,30,29,26,20,14]
["Mosman","Stable","Stable",-3.6,0.25666467770000001,118,153.1,128.9,153.69999999999999,165.3,113,71.2,98.4,74.7,117.3,117.3,46,39,47,51,35,21,28,21,33,33,1,4,5,3,3,5,2,7,2,2,4,8,3,3,3,7,4,5,2,2,1,6,1,2,7,0,1,3,4,4,4,5,4,8,3,4,2,5,5,4,3,4,6,3,7,5,1,6,3,0,3,9,2,0,2,2,4,5,2,3,4,2,1,0,1,3,3,0,0,4,0,3,1,2,3,1,3,0,0,1,6,5,5,1,0,1,1,0,2,3,2,4,4,1,2,1,2,2,1,3,2,2,3,3,0,5,5,5,2,5,3,7,2,1,4,2,0,1,3,3]
["Murray River","Stable","Stable","n.c.",0.65539161229999998,95,195.7,168.5,250.8,123.9,231.1,247.1,187.7,253.5,291.89999999999998,299.60000000000002,23,20,30,15,28,31,24,33,38,39,1,0,1,4,5,1,1,1,3,2,3,1,3,2,1,0,2,3,3,0,2,1,1,2,2,3,4,7,1,3,1,1,4,0,3,1,0,1,0,0,0,4,1,2,3,3,0,1,0,2,5,2,3,2,4,2,2,1,2,3,6,1,2,1,5,6,4,1,1,1,1,2,1,0,3,3,1,1,5,3,3,0,1,3,3,4,3,5,4,4,2,1,1,2,2,2,0,3,8,2,3,3,2,3,4,7,1,2,5,3,5,4,3,2,3,4,0,1,5,4]
["Murrumbidgee","Stable","n.c.","n.c.",1.5334601050000001,36,411,330.9,632.1,657.2,561.70000000000005,663,392.8,392.6,588.9,701.1,16,13,25,26,22,24,14,14,21,25,1,0,5,0,2,2,0,2,1,2,1,0,1,0,3,1,1,0,1,0,3,1,1,1,2,2,0,2,2,2,1,3,7,1,1,2,5,2,3,1,1,0,2,4,4,1,1,2,0,3,0,2,3,2,2,4,3,1,0,2,1,0,3,1,1,3,10,0,1,1,1,2,3,2,0,2,0,1,0,0,1,0,2,3,0,1,1,1,0,0,1,3,1,4,1,1,2,1,2,1,0,5,1,2,5,0,2,0,0,2,3,1,0,1,0,2,11,1,2,2]
["Muswellbrook","Stable",10.4,6.6,2.7110165431,8,699.7,564.9,589.79999999999995,550,647.29999999999995,836.1,795.4,755.7,1009.7,1239.4000000000001,115,93,97,90,106,138,131,125,167,205,9,10,10,7,13,19,9,11,12,2,10,3,4,5,10,13,7,7,7,5,8,9,13,5,4,6,10,8,8,10,6,7,12,9,10,7,7,6,6,9,4,10,5,15,6,7,8,7,12,10,7,7,15,10,6,9,11,7,6,6,10,7,12,11,11,24,10,9,10,15,7,12,7,13,12,9,10,14,8,15,6,9,13,15,7,11,7,16,10,12,11,14,8,8,12,9,9,10,11,18,16,11,19,19,16,9,17,12,22,19,16,22,20,18,15,21,14,11,16,11]
["Nambucca Valley",-24.9,"Stable",2.7,1.4433602094,42,547.6,556.70000000000005,517.79999999999995,546.79999999999995,611,602.5,819.4,878.2,878.2,659.9,107,109,102,108,121,122,167,181,181,136,8,7,6,10,9,16,16,9,11,7,3,5,6,6,8,9,14,15,11,9,10,6,9,6,11,7,7,6,9,9,11,11,12,5,7,7,7,5,9,5,5,21,14,6,9,6,7,14,14,12,10,10,17,12,5,8,8,9,10,6,3,12,4,10,23,15,17,9,8,4,13,4,8,7,9,17,16,25,17,15,7,13,17,16,10,14,12,10,19,33,20,10,14,11,14,14,16,20,26,11,16,16,24,10,16,12,9,5,21,6,8,9,7,8,14,14,12,19,6,12]
["Narrabri","Stable","Stable",5,1.9429919566,18,542.4,725.7,715,612.9,616.70000000000005,724.9,835.4,943.3,801.8,888.3,73,97,95,81,81,94,107,120,102,113,8,6,3,5,1,13,11,4,9,7,2,4,10,6,7,6,14,11,13,6,3,11,6,4,4,9,7,11,11,13,8,9,2,5,8,8,4,10,3,5,5,9,7,10,10,5,4,9,5,8,4,13,6,2,11,5,5,8,6,8,10,10,5,5,8,6,9,18,6,6,5,6,9,4,2,7,10,14,11,10,8,5,12,15,3,5,11,14,10,12,15,5,12,9,6,18,8,13,4,10,8,9,8,8,7,14,3,10,10,9,8,11,11,7,16,3,10,11,9,8]
["Narrandera","Stable","Stable",5.9,1.7969654292999999,22,468.4,420.2,505.5,590.79999999999995,542.6,727.3,976.8,734.1,1101.2,821.5,28,25,30,35,32,42,56,42,63,47,2,2,2,3,3,2,4,4,1,2,1,2,3,3,1,1,2,1,4,3,2,1,2,2,0,0,2,7,2,2,5,5,1,2,2,2,3,3,1,4,5,4,0,3,2,4,4,2,2,1,1,4,6,2,5,2,2,1,4,2,0,3,3,0,1,9,7,4,3,3,1,8,7,4,5,1,6,6,7,2,5,5,2,6,3,4,4,3,3,7,3,2,5,5,1,2,5,7,2,4,6,5,7,6,5,2,8,6,3,6,5,1,2,6,8,3,3,5,3,2]
["Narromine","Stable",15.2,3.4,2.7554203265999999,7,899.8,816.1,759.4,1052,1304.5,706.6,1101.0999999999999,1073.0999999999999,1057.5,1259.7,60,54,50,69,85,46,71,69,68,81,3,3,3,2,7,2,11,7,12,3,5,2,5,4,5,6,5,6,5,2,9,3,3,1,2,2,6,2,8,3,3,6,6,4,3,5,1,5,3,6,5,9,8,4,10,5,7,6,6,8,9,8,4,8,15,4,5,1,7,10,1,4,2,3,4,2,6,1,4,8,4,7,5,4,5,5,4,7,10,6,7,4,9,5,6,3,7,6,9,11,11,4,3,0,5,4,8,3,3,12,6,5,7,7,8,0,5,4,4,4,11,11,5,7,5,12,7,5,5,5]
["Newcastle","Stable",2.6,"Stable",0.96532747590000001,71,444.6,426.9,426.5,398.3,386.6,407.4,398.4,447.2,483.3,441.3,710,686,693,653,640,684,675,767,829,757,43,54,57,61,75,57,67,72,72,47,45,60,49,43,67,54,55,58,71,60,65,55,59,50,50,51,55,51,80,74,87,49,53,51,45,47,54,59,50,59,60,54,51,62,43,53,62,46,53,31,48,52,53,64,63,57,67,56,48,48,54,68,56,62,68,63,58,41,53,46,58,57,47,53,45,59,78,70,49,53,43,58,54,66,49,47,65,47,57,86,70,61,86,61,78,60,72,64,44,78,56,70,85,82,74,68,65,71,62,59,42,59,71,61,70,69,74,74,61,55]
["North Sydney","Stable","Stable",1.6,0.41323301029999998,110,160.9,182.4,190.1,174.1,140.1,126.2,135.30000000000001,118.3,131.19999999999999,188.9,114,131,139,129,105,90,94,82,91,131,10,12,4,10,12,15,12,7,8,6,12,6,8,11,14,6,11,17,7,11,14,11,14,7,9,13,9,13,13,11,21,11,11,7,11,10,12,10,6,11,9,15,9,12,13,13,12,7,13,9,6,9,7,11,6,10,8,10,6,10,6,12,4,6,12,6,11,6,6,8,9,4,7,4,12,6,15,4,8,11,7,6,8,6,9,8,3,7,3,9,5,9,9,5,6,9,3,7,5,9,8,6,8,8,7,7,13,10,7,7,10,18,16,15,13,7,6,4,11,17]
["Northern Beaches",26.4,-6.6,"Stable",0.26666823350000002,116,133.30000000000001,121.3,125.7,142.1,175.9,157.69999999999999,124,102.5,96.5,121.9,350,322,338,385,481,422,328,270,254,321,32,30,22,23,30,31,44,22,32,36,24,24,30,28,29,26,26,25,21,36,25,33,18,25,30,19,20,22,20,36,31,31,38,43,22,26,12,28,28,24,21,54,50,35,39,31,34,29,24,24,34,44,44,60,55,33,43,48,36,36,50,25,40,53,35,33,32,28,30,34,24,38,13,27,40,31,28,26,23,24,25,36,34,21,24,22,25,20,21,22,20,26,20,29,22,19,19,13,21,22,25,30,18,23,19,24,25,15,15,24,25,24,28,34,40,33,29,19,30,20]
["Oberon","n.c.","n.c.","n.c.",0.89884817510000004,76,544.20000000000005,392.6,352.7,462.7,480.5,416.1,395.2,268,250.1,410.9,29,21,19,25,26,23,22,15,14,23,0,0,5,1,4,1,1,6,0,9,2,0,1,4,1,1,4,2,0,2,3,1,1,1,1,2,4,0,0,0,3,2,1,2,3,1,1,0,2,1,1,3,5,1,3,4,3,1,7,0,1,3,1,4,0,1,5,3,0,1,1,1,0,10,2,1,3,2,1,1,1,0,2,0,4,2,3,4,1,0,1,2,0,3,3,0,2,1,0,0,0,3,1,0,3,2,0,2,1,3,2,1,0,0,3,0,0,2,3,4,1,1,0,0,6,2,2,0,3,1]
["Orange","Stable","Stable","Stable",1.5423686351999999,34,732.2,718.3,628.9,609.5,633.79999999999995,690.5,681.1,755.2,823.4,705.1,299,296,261,256,269,299,298,332,362,310,17,23,26,22,27,34,33,27,22,16,27,25,32,20,19,35,37,20,34,22,19,23,12,23,20,17,17,17,20,30,25,21,21,26,26,21,19,26,21,13,17,33,23,23,17,22,25,17,21,19,15,14,19,28,35,33,18,32,20,15,28,21,23,28,39,23,43,24,25,14,14,17,16,29,20,21,24,16,26,27,30,35,36,18,29,26,23,24,20,24,39,22,27,32,38,28,45,43,23,46,24,34,25,22,36,14,26,24,18,24,14,22,24,19,27,33,27,42,41,19]
["Parkes","Stable",11.8,2,2.1191783762999998,13,775.7,616.5,885,537.70000000000005,539.29999999999995,608.6,788.9,794.6,913.1,968.8,116,92,132,80,80,89,114,114,131,139,7,5,11,10,8,7,12,28,5,6,7,10,12,4,5,13,5,9,11,7,7,6,7,6,9,10,13,12,14,16,14,7,7,7,11,12,1,2,8,6,6,3,10,7,15,7,8,7,3,7,3,5,7,11,12,7,10,5,2,8,9,6,6,9,7,7,7,11,10,6,5,6,7,8,7,5,14,12,9,9,8,13,11,11,6,10,7,12,13,7,10,7,8,12,13,9,12,7,7,12,15,12,12,17,8,12,9,8,12,13,10,16,11,9,12,14,12,12,15,3]
["Parramatta","Stable","Stable",2.8,0.71152680800000001,89,289,273.8,275.5,279.60000000000002,303.8,314.5,337.7,310.3,302.3,325.3,658,642,671,702,781,817,873,808,787,847,35,47,54,72,48,73,55,61,63,55,50,45,46,57,39,53,62,55,59,51,64,60,58,38,53,49,35,46,55,64,59,67,58,61,53,71,64,44,60,69,57,65,71,58,57,50,49,58,61,56,64,53,73,103,63,78,64,59,65,42,56,62,68,63,55,67,77,70,98,59,70,72,60,67,63,84,79,87,78,69,83,71,86,46,57,61,61,60,79,78,53,71,75,80,72,61,75,71,55,59,80,52,79,66,62,53,63,72,73,85,61,65,60,82,76,58,88,86,50,63]
["Penrith",16.8,"Stable",1.7,1.2644255571,51,556,514.4,520.9,562.29999999999995,592.6,652.70000000000005,574.29999999999995,505.2,494.8,578.1,1099,1037,1069,1175,1262,1413,1259,1116,1093,1277,86,108,94,80,91,89,95,91,110,80,93,82,65,73,75,82,91,118,82,88,107,91,73,92,70,89,69,81,97,115,100,94,89,85,101,79,90,89,77,107,101,109,116,96,109,89,81,111,93,110,97,115,127,98,109,95,105,113,104,96,95,108,127,124,109,146,133,108,123,96,116,128,114,94,109,141,116,106,111,95,85,99,114,75,65,82,87,84,102,119,103,99,82,112,94,87,73,88,79,84,83,86,101,100,124,101,84,90,86,105,114,124,116,151,95,109,109,62,95,111]
["Port Macquarie-Hastings","Stable",10.4,6.3,1.1641176321,56,343.1,306,335.2,288.89999999999998,323,370.4,435.1,405.4,516.4,532.20000000000005,271,245,273,240,273,316,377,358,456,470,9,20,20,15,34,29,28,19,23,27,25,22,17,23,32,17,21,15,21,19,20,18,14,28,19,20,24,22,23,26,20,19,35,19,25,21,14,22,12,24,12,23,27,17,19,16,14,40,28,28,13,18,29,23,20,28,24,26,27,9,24,34,21,32,32,38,25,32,29,15,18,16,18,34,30,28,32,40,34,36,40,28,30,27,31,32,29,32,29,39,42,30,27,27,20,20,32,33,43,32,41,38,48,54,37,37,25,36,32,42,35,26,56,51,31,32,53,31,25,56]
["Port Stephens","Stable",8,4.3,1.4606527505,41,498.2,444.4,465.4,494.3,469.6,506.1,493.8,447.4,520.4,667.8,350,316,334,359,345,376,372,343,399,512,31,23,37,34,28,22,28,30,33,19,36,29,19,27,21,26,29,35,41,24,20,26,31,17,25,33,28,57,29,23,26,28,24,23,19,19,21,18,24,33,29,50,26,37,39,28,33,21,30,27,26,30,21,32,47,22,34,26,27,23,23,25,32,41,37,42,36,28,21,35,26,30,19,29,24,38,24,50,29,44,27,24,37,27,27,25,24,24,33,31,27,35,33,34,27,23,36,36,32,28,34,50,31,37,31,33,26,25,44,42,55,41,48,48,51,44,42,38,37,22]
["Queanbeyan-Palerang Regional","Stable","Stable",5.5,0.72532927960000004,84,229.3,273.39999999999998,238,227.1,193.2,304.60000000000002,282.3,274,369,331.6,131,158,140,136,118,190,179,176,237,213,9,8,11,6,10,7,10,13,14,14,14,15,5,15,11,13,22,7,19,18,16,16,10,6,11,10,19,10,20,7,13,9,11,6,14,10,10,12,6,14,16,12,10,6,19,9,12,10,11,12,17,11,9,9,17,5,8,6,2,11,19,10,16,13,18,21,16,10,15,12,18,22,8,17,18,18,22,15,11,19,13,15,13,10,11,18,15,19,21,19,14,13,7,11,17,11,23,23,25,17,17,13,18,17,16,20,30,18,13,15,25,20,18,14,21,19,21,17,11,19]
["Randwick","Stable","Stable","Stable",0.61741552570000002,97,238.2,249.8,247.8,212.8,260.39999999999998,286,287.7,267.5,291.89999999999998,282.3,350,372,377,328,405,407,389,363,396,383,25,23,30,33,21,41,34,31,41,24,23,24,25,36,38,21,31,41,32,22,33,39,29,25,32,27,28,38,36,30,35,23,47,24,29,28,22,25,22,38,27,34,43,26,29,21,18,23,34,19,39,33,26,50,51,32,35,23,26,37,35,37,27,33,43,41,35,40,33,24,33,26,35,28,25,25,47,41,40,28,29,30,32,29,24,30,27,43,43,33,29,25,24,41,20,24,25,24,34,34,28,38,36,33,51,30,34,29,40,43,29,37,25,39,38,23,43,17,26,23]
["Richmond Valley","Stable",11.8,6.1,1.7995479760999999,21,492.5,559,694.4,521.9,579.70000000000005,530.79999999999995,707.8,649.70000000000005,662.4,822.7,114,130,162,122,136,125,167,154,157,195,7,3,18,13,9,8,10,6,15,10,8,7,16,14,12,12,10,12,8,9,8,9,12,8,11,10,10,13,17,14,22,24,11,14,7,9,9,7,12,9,8,17,8,5,13,13,8,13,9,16,7,6,9,17,17,14,12,4,20,5,25,11,4,3,10,20,10,13,5,8,6,10,14,13,17,16,20,20,16,12,8,7,11,13,8,6,15,12,15,18,15,8,16,15,20,6,19,19,11,13,8,12,9,16,14,13,15,8,15,19,13,23,13,19,17,14,15,18,16,13]
["Ryde",38.9,-2.5,8,0.48209884359999999,105,122.4,164.1,162.9,179,220.3,244.7,241.9,164,158.6,220.4,145,199,203,228,289,320,314,215,208,289,10,13,9,11,12,17,13,18,11,9,5,17,13,10,14,18,25,15,37,11,12,17,13,14,22,15,15,15,25,11,16,24,17,8,19,16,20,14,18,19,14,21,15,16,19,25,20,27,18,21,16,20,30,31,21,16,36,26,28,26,30,17,20,19,29,27,28,31,16,35,36,32,23,18,29,20,30,22,39,25,27,30,31,20,14,22,15,19,23,19,24,17,19,15,24,4,20,16,18,19,15,20,18,16,18,11,19,18,16,28,16,21,13,36,29,34,28,19,26,23]
["Shellharbour","Stable","Stable","Stable",0.69251036420000001,93,390.1,400.6,309.7,310.39999999999998,285.39999999999998,353,313.8,293.60000000000002,344.7,316.60000000000002,271,282,220,224,209,264,240,230,270,248,17,20,21,23,23,43,29,19,30,13,19,14,29,21,19,18,34,27,28,28,19,12,28,19,19,9,22,16,14,20,23,26,18,22,13,18,21,20,17,27,15,18,23,16,20,22,9,16,13,20,10,12,15,24,23,20,17,15,26,14,18,21,21,13,28,22,28,25,22,21,20,25,14,16,27,19,14,32,19,14,23,17,18,27,25,12,13,22,27,20,21,21,22,16,18,13,16,26,18,35,24,24,26,18,20,28,12,23,13,25,22,20,20,18,28,20,22,15,20,25]
["Shoalhaven","Stable","Stable",2.8,0.99976377770000002,66,389.9,396.3,356.1,335.7,414.6,400.9,433.9,395,429.7,457.1,392,404,367,350,438,429,471,433,471,501,29,36,35,34,37,39,32,45,14,24,27,40,26,39,32,32,46,27,49,36,37,19,40,21,26,23,35,42,33,32,41,29,26,20,23,37,22,30,24,29,25,32,40,21,44,34,26,23,34,42,28,48,37,53,52,30,38,26,24,26,28,14,35,36,43,39,52,43,38,30,34,37,31,46,41,37,41,34,57,38,38,41,28,39,35,35,28,40,29,41,59,27,42,32,38,27,33,39,43,50,36,43,39,41,49,39,26,33,39,33,39,41,30,59,53,46,44,45,39,33]
["Singleton","Stable","Stable",5.4,0.97629091499999998,68,296.8,352.1,361.7,483,405,323,440.8,406.5,418.4,446.3,70,83,85,113,95,79,109,102,105,112,4,4,6,3,3,6,7,9,6,6,9,7,8,2,8,12,7,6,4,7,9,5,7,8,8,7,8,7,6,8,9,8,10,4,5,5,10,13,14,13,14,5,11,6,9,8,6,4,10,8,8,9,9,8,8,8,1,7,15,4,5,9,9,6,6,11,3,7,7,4,6,6,10,9,7,8,12,17,4,8,11,6,9,8,6,7,5,3,8,15,17,11,17,6,1,6,8,15,8,8,7,5,8,10,10,12,7,7,8,9,6,8,9,15,13,10,11,8,9,6]
["Snowy Monaro Regional","Stable","Stable",7.2,0.71163566909999998,88,185.6,233.5,285.5,265.5,298.2,383.3,276.89999999999998,284.10000000000002,288.7,325.3,38,48,59,55,62,82,60,62,63,71,3,2,2,4,4,2,4,3,5,2,2,5,6,3,4,2,5,6,2,6,2,5,2,5,8,4,4,2,8,7,6,7,2,2,5,4,7,7,7,4,5,3,6,2,3,3,4,4,3,8,2,2,6,5,9,3,6,5,8,5,10,1,11,11,10,7,5,9,3,5,4,6,3,8,6,2,6,6,2,5,9,3,4,6,5,6,5,8,3,4,2,8,9,2,4,6,4,5,6,8,4,7,3,7,6,6,3,4,5,6,6,4,9,6,3,8,6,12,1,5]
["Snowy Valleys","Stable","Stable","Stable",1.1276393748,58,464.5,568.1,570.1,440.9,421.4,618.9,396,435.2,495.4,515.5,68,83,83,64,61,92,59,65,74,77,1,14,8,5,4,5,2,4,5,3,9,8,4,7,7,10,13,6,8,7,5,7,4,5,10,9,10,7,5,10,2,7,2,9,3,9,0,4,7,6,5,9,7,1,11,7,4,3,3,2,3,9,6,10,8,7,2,7,1,3,4,8,9,6,9,10,10,8,4,3,12,9,3,7,2,6,6,9,5,3,4,5,6,3,3,4,5,4,4,5,5,4,10,9,7,5,5,6,11,1,7,16,9,5,5,3,1,5,3,8,3,3,5,5,12,4,6,6,11,11]
["Strathfield","Stable","Stable",3.3,0.70971041329999995,90,271.3,264.10000000000002,209.8,350.3,285.7,343.3,258.89999999999998,272.60000000000002,322.3,324.5,112,112,92,158,134,159,119,126,149,150,10,5,8,8,10,14,6,7,17,6,8,13,9,4,9,9,4,15,13,11,14,8,6,10,9,6,7,6,7,12,9,5,12,8,4,7,10,23,11,15,18,9,8,10,14,14,12,14,7,9,11,13,19,11,13,15,11,7,7,11,14,6,11,17,15,14,20,10,13,15,11,13,12,5,8,8,10,10,19,12,11,11,6,7,6,3,12,12,14,11,9,15,15,10,14,5,14,10,5,13,14,17,11,13,9,9,19,15,13,8,14,9,11,16,4,15,17,12,16,15]
["Sutherland Shire","Stable",-4.5999999999999996,2.7,0.52456837999999995,103,194,216.8,205.5,209.6,245,291.39999999999998,292.2,295.89999999999998,273,239.8,437,491,468,480,565,670,675,686,633,556,33,24,38,36,39,44,41,40,45,33,35,29,47,47,34,44,27,33,44,47,35,57,43,33,31,34,43,49,32,36,47,52,34,40,33,37,30,33,45,38,44,49,42,37,46,47,32,37,27,32,30,34,41,53,71,64,55,67,42,49,55,49,46,51,79,60,67,54,72,45,52,40,46,51,40,67,71,48,74,51,65,53,52,57,62,53,53,46,55,53,77,55,72,54,47,59,51,44,59,38,57,74,45,45,69,56,45,50,50,47,42,37,56,50,49,50,45,47,38,45]
["Sydney","Stable",3.7,2.4,1.243620283,"n.c.",466.3,438.7,427.6,417.3,449.3,473.1,510.9,489.2,555.29999999999995,568.6,998,977,997,1002,1105,1074,1097,1067,1211,1240,71,68,92,100,82,104,95,86,89,83,54,74,75,90,84,85,70,107,76,89,74,73,84,70,76,77,83,91,76,93,95,90,89,76,84,67,78,81,79,110,72,94,96,72,93,67,81,79,84,87,92,72,74,110,88,118,102,91,81,106,79,90,95,87,74,100,106,97,97,86,79,84,84,85,83,106,100,107,81,110,74,90,87,90,81,58,71,84,84,104,109,87,121,91,88,89,111,112,99,99,105,103,104,98,124,96,80,80,104,113,86,93,88,111,122,88,110,115,114,96]
["Tamworth Regional",44.7,10.6,7.2,2.1933617813000001,12,570.9,588.6,576.20000000000005,547.6,610.9,682.6,691.1,619.9,692.8,1002.8,345,359,355,340,382,432,440,400,447,647,21,26,29,34,38,32,37,32,24,18,28,26,30,27,36,29,35,39,42,28,28,21,24,20,20,28,27,27,36,35,48,33,41,21,23,16,23,29,23,26,24,38,33,24,36,30,20,34,14,24,34,36,32,58,39,32,32,29,26,26,44,25,36,34,47,41,39,29,22,32,42,41,24,30,37,44,27,48,41,20,47,48,39,35,26,29,24,40,28,29,37,42,47,39,37,22,42,39,39,27,36,39,41,44,45,35,26,34,54,31,30,46,49,79,54,74,60,51,58,61]
["Temora","n.c.","n.c.","n.c.",0.43775733700000002,107,405.5,322.10000000000002,352.6,303.2,269.5,461.6,415.8,166.8,517,200.1,25,20,22,19,17,28,25,10,31,12,4,4,1,3,2,2,1,0,2,2,2,2,0,3,2,2,1,5,1,2,0,3,0,1,2,2,0,0,0,3,4,1,3,4,3,0,1,0,2,0,1,8,2,1,2,0,1,1,0,0,0,1,2,3,0,3,2,4,0,2,1,3,10,3,0,0,5,1,1,2,1,1,2,3,2,2,4,1,2,3,2,1,3,0,2,1,0,2,0,0,1,1,2,0,1,0,1,2,1,1,2,1,1,1,16,1,4,0,0,1,0,2,1,1,0,2,2,1,1,1]
["Tenterfield","Stable","Stable","Stable",1.780641658,23,923.6,836.2,720.7,588.1,1061.5999999999999,635.5,1117.5999999999999,625.1,697.8,814.1,62,56,48,39,70,43,76,43,48,56,2,5,3,5,14,7,9,8,3,0,4,2,3,2,8,5,5,4,7,9,5,1,5,2,4,1,9,3,2,6,7,2,1,6,2,5,1,2,3,6,3,3,5,1,3,4,3,5,4,5,3,3,2,8,6,9,12,11,1,6,4,0,2,1,3,0,6,2,4,2,13,6,4,10,6,5,6,1,7,10,9,6,5,7,1,4,5,7,1,5,4,2,2,2,5,5,3,5,2,1,9,5,9,6,3,3,1,1,10,10,4,1,6,3,6,5,7,1,1,2]
["The Hills Shire","Stable","Stable",4.3,0.31726809630000002,114,124.6,139.30000000000001,122.7,121.3,142.19999999999999,186.4,177.5,149.6,171.1,145,198,227,206,209,253,347,342,298,341,289,16,25,19,14,20,14,17,13,19,17,10,14,21,21,15,18,21,20,17,17,25,14,22,16,11,18,11,23,19,13,23,23,13,10,17,25,12,11,20,18,17,28,17,12,20,13,14,27,17,21,11,16,19,30,21,15,25,24,27,27,25,14,29,19,30,43,39,24,43,17,30,34,23,22,22,23,29,27,28,31,35,30,35,37,15,23,20,28,21,32,26,31,24,25,30,23,22,31,35,27,25,26,34,31,30,20,25,35,18,29,25,24,24,13,26,24,28,29,25,24]
["Tweed","Stable","Stable","Stable",0.71668805999999996,87,405.4,307.2,331.9,311.39999999999998,355.7,318.7,375.5,398.1,388.9,327.7,374,288,315,299,345,308,365,390,381,321,22,41,32,35,26,44,31,34,40,29,20,20,25,33,22,23,22,35,27,17,21,18,23,22,24,28,25,23,25,36,21,29,39,21,24,20,21,20,25,15,26,30,36,31,28,21,28,18,26,26,20,35,27,30,47,37,33,22,24,18,23,20,37,20,24,33,29,13,34,18,28,29,27,26,31,29,39,36,43,27,29,24,25,29,25,31,24,27,35,42,37,49,37,28,29,26,28,38,35,33,28,48,30,31,23,35,19,33,22,22,28,19,24,31,14,33,38,36,33,21]
["Unincorporated Far West","n.c.","n.c.","n.c.",".","n.c.","      . ","      . ","      . ","      . ","      . ","      . ","      . ","      . ","      . ","      . ",7,4,2,1,1,5,2,1,3,4,0,0,1,0,2,0,2,2,0,0,0,0,0,0,0,0,0,0,1,0,0,1,1,1,0,0,0,0,1,1,0,0,0,0,0,0,0,0,0,0,0,0,0,0,0,1,0,0,0,0,0,0,0,0,0,0,0,0,0,1,1,0,0,0,0,1,3,0,0,0,0,0,1,0,0,0,0,0,0,1,0,0,0,0,0,0,0,0,0,0,0,0,0,1,0,0,0,0,0,0,2,0,0,0,1,0,0,0,0,1,1,1,1,0,0,0,0,0,0,0]
["Upper Hunter Shire","Stable","Stable",12.5,1.0559406497999999,62,166.5,230.1,196.2,253.4,402,434.5,526,433.8,412.8,482.8,24,33,28,36,57,62,75,62,59,69,1,0,0,0,5,3,2,2,2,0,8,1,4,2,4,2,0,0,4,3,6,2,4,2,1,2,4,3,1,5,1,2,3,4,0,2,2,2,6,1,3,1,3,2,5,6,3,2,0,3,8,9,5,8,9,2,4,2,1,6,0,3,5,2,3,6,8,2,9,8,7,9,13,2,5,2,8,4,10,14,4,2,7,4,7,3,1,2,5,8,7,5,5,4,10,5,5,12,3,1,1,11,2,6,1,2,7,8,13,5,4,4,5,6,6,4,10,0,3,9]
["Upper Lachlan Shire","Stable","n.c.","n.c.",0.51159571839999995,104,217.8,331.1,88.5,100.6,99.3,71.8,164.8,152,257.3,233.9,17,26,7,8,8,6,14,13,22,20,1,2,2,2,3,1,2,0,0,2,0,2,2,1,0,4,2,0,5,2,1,3,4,2,2,0,0,1,0,0,1,0,1,0,1,1,2,0,1,0,0,1,0,2,0,0,2,0,0,0,1,0,3,0,2,2,0,0,0,0,0,0,0,0,1,3,0,0,0,2,0,0,1,0,0,2,2,2,0,1,3,2,1,0,1,1,1,1,2,0,1,0,0,2,2,2,0,1,0,2,6,2,2,2,2,2,1,2,1,1,2,1,0,4,3,0,2,2,1,3]
["Uralla","Stable","n.c.","n.c.",0.73093650590000003,82,258.3,276.60000000000002,294.8,478.8,216.3,264.60000000000002,200.3,434.4,434.4,334.2,16,17,18,29,13,16,12,26,26,20,2,2,1,0,7,1,1,1,0,1,0,0,0,0,0,3,0,2,1,1,3,1,2,4,2,1,0,3,0,4,1,0,1,1,3,2,1,2,3,3,2,2,3,1,5,3,3,1,1,0,0,2,0,0,2,0,1,1,2,4,0,2,2,0,0,2,5,1,0,1,0,3,1,0,0,3,1,4,0,0,1,0,2,0,2,3,3,5,2,3,3,2,0,2,0,1,5,3,1,0,3,0,3,5,2,2,0,2,0,0,0,2,3,0,2,4,2,3,2,2]
["Wagga Wagga","Stable","Stable",6,1.5939960664999999,33,464.3,630.6,564.4,614.70000000000005,701.9,738.7,668.7,664.4,791.7,728.7,294,403,363,398,458,496,454,454,541,498,25,17,29,27,25,27,26,25,28,14,22,29,22,23,25,35,40,38,39,26,42,29,39,45,28,29,38,23,32,29,42,25,34,17,31,35,31,21,30,31,39,40,44,37,29,31,33,32,30,21,35,33,30,54,50,35,42,42,44,42,25,55,22,49,52,57,43,38,31,38,42,44,40,39,35,47,31,30,38,23,47,43,35,46,46,24,38,37,33,50,39,26,54,35,38,34,37,44,65,42,45,55,58,44,39,42,27,43,29,49,27,51,53,33,53,40,57,41,30,35]
["Walcha","Stable","n.c.","n.c.",1.6713798125999999,27,191.8,191.7,349.7,223.7,414.8,327.8,430.6,730.9,730.9,764.1,6,6,11,7,13,10,13,22,22,23,0,0,0,0,0,0,1,1,1,2,1,0,0,0,0,1,2,0,0,0,2,0,1,0,2,2,0,0,2,0,2,1,0,1,0,1,1,1,1,0,0,1,0,0,0,2,1,0,1,0,2,1,1,4,2,0,0,0,1,1,1,0,3,1,0,0,1,1,2,0,0,1,0,2,0,5,1,2,0,1,0,1,0,1,0,5,1,0,1,5,4,0,3,0,0,3,2,0,1,2,4,4,4,0,3,1,0,1,2,2,4,0,2,1,0,5,2,2,1,2]
["Walgett","Stable",7,"Stable",8.0498093047000001,1,2850.9,2263.6999999999998,2081.6999999999998,2581.1,2217.6999999999998,2722.6,2577,2157.4,3607.7,3680.2,183,143,129,156,132,155,144,119,199,203,6,10,19,18,18,20,20,13,17,13,15,14,5,9,21,14,14,20,15,12,6,15,6,6,6,4,10,7,9,20,13,13,17,9,8,13,7,13,16,18,4,17,12,10,15,13,21,10,9,9,15,13,11,9,14,12,9,5,9,17,9,9,14,13,16,19,18,4,14,15,14,10,9,8,7,10,16,19,16,11,5,16,19,8,11,10,8,9,5,14,5,13,5,8,19,12,14,17,21,9,19,23,22,12,18,18,8,18,15,14,16,15,24,20,13,15,21,22,17,11]
["Warren","Stable","Stable","Stable",".","n.c.","      . ","      . ","      . ","      . ","      . ","      . ","      . ","      . ","      . ","      . ",39,35,31,31,40,44,39,37,32,67,2,4,1,4,8,4,3,1,4,3,3,2,3,6,0,4,1,0,3,9,3,5,0,1,4,3,2,2,3,2,3,0,2,3,2,5,0,1,2,1,2,3,5,2,5,3,5,2,1,7,2,6,1,4,5,5,2,4,3,0,1,3,3,2,9,3,5,6,2,2,6,2,6,1,4,1,2,6,4,4,1,5,0,5,5,1,3,2,4,4,5,0,4,0,8,1,1,6,1,6,2,2,3,1,1,0,4,5,3,6,4,6,10,10,5,1,4,3,12,3]
["Warrumbungle Shire","Stable",13.2,"Stable",1.5140488817,37,488.5,481.1,507.6,553.79999999999995,549.70000000000005,417.5,399.7,648.9,995,692.2,47,46,48,52,51,39,37,60,92,64,3,1,5,3,4,4,3,6,3,6,4,5,2,2,3,3,6,3,10,3,4,4,4,2,7,4,2,4,1,4,5,4,3,3,7,4,3,4,3,4,3,7,12,2,4,5,5,0,6,3,3,5,4,3,4,7,6,4,2,4,4,4,2,1,5,3,4,3,4,2,3,4,1,2,2,3,2,3,4,9,6,1,2,2,4,0,1,3,6,14,11,2,6,6,4,3,2,7,9,13,7,14,11,7,8,1,6,7,6,2,9,4,7,4,6,10,5,1,7,3]
["Waverley","Stable","Stable","Stable",0.7004597306,91,241.1,256.89999999999998,226.2,203.9,223.7,267.60000000000002,255.1,261.10000000000002,272.60000000000002,320.2,172,185,166,151,166,192,177,181,189,222,8,13,9,17,14,8,16,9,19,29,18,12,11,7,10,17,23,29,17,20,19,12,11,9,12,5,13,14,18,20,16,21,13,14,8,12,17,10,10,12,9,15,18,11,11,12,6,20,13,4,8,14,19,20,23,12,7,27,12,7,13,18,10,9,26,32,16,16,14,16,13,9,17,6,19,9,24,13,12,14,13,15,12,23,16,15,19,18,13,20,8,16,19,8,14,15,12,12,17,25,15,14,23,17,14,20,9,11,20,22,24,14,17,11,24,15,26,33,6,10]
["Weddin","n.c.","n.c.","n.c.",1.3920457209999999,44,216.9,299.2,247,192.7,193.7,304.60000000000002,445.4,359.7,83,636.4,8,11,9,7,7,11,16,13,3,23,0,1,0,0,0,1,0,1,1,2,0,2,1,1,1,1,0,0,0,2,3,0,1,1,0,1,0,0,1,0,3,1,1,0,0,2,0,2,1,1,0,1,1,0,1,0,0,0,0,1,1,0,0,0,2,0,0,2,0,1,1,1,0,1,2,0,2,1,0,1,1,1,3,1,0,2,1,1,2,2,0,1,0,3,0,2,3,0,2,0,4,0,0,1,1,0,0,1,0,0,0,0,0,0,1,0,1,0,0,1,0,1,2,2,5,1,2,8,1,0]
["Wentworth","Stable","Stable","Stable",2.3033592142999999,11,914.4,981,602,1208.5999999999999,907.4,990,867.8,987.2,1026.7,1053,63,68,42,85,64,73,65,75,78,80,7,5,3,5,4,6,7,1,9,9,1,6,4,1,9,4,7,8,7,8,6,4,6,4,6,5,3,1,1,7,5,3,2,2,2,5,2,9,3,10,3,14,8,7,9,11,4,5,2,5,3,5,4,9,10,3,4,7,5,7,4,12,3,3,6,8,7,9,7,3,5,6,6,6,6,2,5,5,11,5,4,3,8,4,5,8,5,3,9,10,15,3,6,4,6,1,5,11,7,6,10,4,6,11,6,3,2,7,8,3,8,2,5,4,9,11,10,7,9,4]
["Willoughby","Stable",7.4,4.4000000000000004,0.36226986700000002,111,111.9,97.6,90.3,133.30000000000001,131.9,119.9,111.8,147.1,156.30000000000001,165.6,85,76,72,107,107,94,85,111,118,125,7,11,3,3,9,6,8,11,7,9,5,6,4,5,7,7,12,5,9,4,12,2,3,6,8,6,6,6,4,7,7,5,5,10,5,3,5,6,6,7,6,11,13,9,15,7,10,12,5,13,4,6,11,16,12,9,6,7,7,11,12,6,11,6,6,4,7,9,15,3,11,4,9,9,6,5,10,8,6,4,4,10,8,6,8,9,7,9,13,8,11,12,7,8,11,8,10,12,9,7,6,5,9,16,8,8,14,14,8,13,14,5,15,12,10,7,12,8,8,13]
["Wingecarribee","Stable","Stable","Stable",0.3480168756,112,265.8,244.9,277.8,160.5,191.7,206.1,203.9,217.8,255.7,159.1,128,120,138,81,98,107,107,115,135,84,9,10,8,13,8,19,10,8,14,12,11,6,10,2,13,10,16,12,13,7,12,5,8,12,9,7,10,12,16,14,12,11,11,12,15,9,5,10,6,4,5,3,13,6,6,10,7,6,7,5,7,14,7,6,11,11,9,6,9,6,5,4,10,6,10,13,11,6,8,12,10,12,7,10,7,4,11,11,10,12,4,11,15,5,15,13,5,16,8,9,12,7,11,5,6,8,8,7,15,11,10,13,11,14,18,4,8,16,9,11,4,5,13,4,4,6,11,6,5,6]
["Wollondilly",39.200000000000003,"Stable","Stable",0.80749352829999999,77,356.2,359,317.39999999999998,362.3,333.1,319.60000000000002,308.10000000000002,304.7,265.2,369.2,173,179,162,189,177,171,167,170,148,206,20,10,13,17,8,11,11,19,14,10,19,21,11,11,16,8,12,27,21,18,20,15,9,11,12,16,10,18,17,18,13,7,11,19,11,10,13,21,17,15,13,17,21,11,21,13,9,18,9,21,8,10,11,37,16,17,11,16,13,8,11,11,13,16,14,19,22,18,15,8,12,12,16,22,13,14,14,15,16,15,4,13,11,14,11,10,12,21,10,9,18,18,12,17,16,16,13,12,16,5,15,11,11,16,15,12,13,9,17,25,15,13,18,21,15,16,20,14,14,18]
["Wollongong","Stable","Stable","Stable",0.72664658390000003,83,344.2,383.1,326.3,298.8,327,301.39999999999998,327.39999999999998,290.2,297.10000000000002,332.2,717,806,696,645,713,647,703,628,643,719,61,44,53,67,70,81,63,68,51,45,57,57,51,64,56,77,71,63,83,88,68,74,66,45,74,49,76,59,51,60,81,56,61,37,54,38,45,45,52,56,58,72,42,48,72,61,55,39,51,48,59,54,62,77,69,66,48,60,68,51,53,46,46,48,57,77,47,60,66,51,42,54,60,43,75,52,52,61,92,48,56,63,49,52,45,47,38,54,52,56,57,57,45,51,65,61,56,45,45,52,63,61,59,55,63,44,53,47,68,56,56,55,63,79,62,60,63,55,50,52]
["Woollahra","Stable","Stable",2,0.44151269850000002,106,156.5,136.80000000000001,167.5,159.6,139.9,171.9,144.69999999999999,235.5,241.1,201.9,90,79,98,94,83,96,78,126,129,108,3,5,9,6,9,11,5,3,9,12,10,8,4,6,11,5,6,9,5,10,9,6,3,5,4,3,13,7,10,14,7,6,8,10,5,11,7,4,9,8,7,11,12,3,9,10,11,3,9,3,5,11,8,9,5,5,11,5,6,6,16,7,8,12,5,9,8,7,7,4,5,8,9,3,6,7,15,3,7,6,7,5,3,7,12,11,16,12,8,8,10,3,11,7,8,20,8,9,7,9,16,9,11,20,6,15,16,3,10,6,13,15,12,10,4,14,9,4,6,5]
["Yass Valley","Stable","Stable",5.0999999999999996,0.5915437724,100,183.4,156.9,203,188.9,128.80000000000001,175.9,185.6,207.1,305,270.39999999999998,30,26,34,32,22,30,32,36,53,47,1,3,3,3,6,1,0,0,2,3,4,4,0,6,0,2,2,1,4,1,5,4,0,1,3,4,3,1,1,5,2,4,6,0,3,2,1,2,1,0,3,2,6,6,3,0,1,7,1,2,1,2,0,5,3,0,3,2,0,3,2,3,2,5,3,3,1,0,8,0,1,2,1,2,2,6,1,5,1,3,1,4,4,2,2,6,3,2,2,6,1,2,2,5,3,2,3,8,7,4,12,2,3,3,4,3,2,2,2,8,0,6,3,2,9,1,3,2,2,9]
["NSW**",6.5,4,2.8,1,"n.c.",382,379,365.4,359.9,377.9,394,406.9,391.5,429.3,457.2,29094,29305,28753,28720,30566,31888,32948,31969,35059,37332,2119,2232,2334,2501,2653,2795,2808,2393,2534,2226,2313,2186,2136,2300,2226,2507,2729,2755,2720,2523,2700,2285,2257,2167,2227,2174,2276,2460,2543,2815,2866,2463,2522,2204,2133,2070,2037,2075,2249,2509,2406,2951,2846,2329,2559,2336,2185,2238,2255,2303,2304,2501,2563,3298,3073,2551,2633,2439,2295,2351,2363,2502,2528,2676,2779,3155,3160,2577,2807,2253,2455,2633,2313,2591,2618,2796,2914,3164,3032,2661,2751,2695,2749,2664,2407,2306,2290,2626,2839,3119,3015,2693,2948,2604,2670,2452,2700,2886,2800,2926,2932,3185,3214,3051,3189,2707,2625,2844,2921,2993,2909,3038,3123,3585,3302,3199,3417,3045,2950,2850]
[]
["Notes:"]
["* NSW Police flag whether criminal incidents that they record on their COPS (Computerised Operational Policing System) database are domestic violence-related. New South Wales police define domestic assault in line with the Crimes (Domestic and Personal Violence) Act 2007. Under this legislation a person has a domestic relationship with another if they are a spouse/partner, ex spouse/ex partner, boy/girlfriend (including ex), parent/guardian (including step/foster), child (including step/foster), sibling, other member of family (including kin), is living or has lived in the same household as other person, is dependant on the paid or unpaid care of the other person, or are involved in a \"love triangle\" (e.g. a woman’s ex-partner and current partner would have a domestic relationship with each other for the purposes of this Act even if they had never met). "]
["** Includes incidents occurring on prison premises."]
["^BOCSAR relies upon the Kendall Rank Order Correlation statistical test (or Kendall's tau-b) to determine whether a series is trending upwards, downwards or is stable (p<.05).  The statistical test is applied to the monthly count data over the specified period. Where a significant trend is found, the average annual percentage change over the time period is reported. If any of the 12-monthly totals in the series have a value of less than 20, a trend test is not conducted. When this occurs, the relevant cell will be left blank or contain 'n.c.' (not calculated).  Significant upward tends are in red and significant downward trends are in green."]
["~The ratio to NSW rate statistics are a comparison of a NSW regional rate per 100,000 population to the  NSW rate per 100,000 population. A ratio of one indicates parity with the NSW rate. Ratios indicating double the NSW rate (or more) before rounding are highlighted in red, whilst ratios indicating half the NSW rate (or less) before rounding are highlighted in green. Ratios are not calculated for regions with a population of less than 3,000. "]
[]
["^^ Ranks are only calculated for LGAs with populations greater than 3,000."]
[]
["^ LGAs with populations lower than 3,000 are excluded from rate calculations (indicated by 'n.c.') because rate calculations for these areas are very sensitive to small changes in population sizes and the number of incidents recorded. Rate calculations should also be treated very cautiously for LGAs that have high visitor numbers relative to their residential population. This is because rate calculations are based on estimated residential population and no adjustment has been made for the number of people visiting each LGA per year. For the rate calculations, specialised population data were prepared and provided to BOCSAR by the Australian Bureau of Statistics."]
[]
["Source: NSW Bureau of Crime Statistics and Research"]
["Please retain this reference number for future correspondence."]
["NOTE: Data sourced from the NSW Bureau of Crime Statistics and Research must be acknowledged in any document (electronic or otherwise) containing that data."]
["The acknowledgement should take the form of 'Source: NSW Bureau of Crime Statistics and Research'."]

{"sheet":"Graph NSW SA4 24 months","index":2,"n_rows":31,"n_cols":11,"rows_kept":31,"cut":false,"hidden":false,"merged":[]}
[{"$f":"'Working SA4'!C8","v":"NSW Recorded Crime Statistics, July 2022 to June 2024"}]
[{"$f":"'Working SA4'!$C$9","v":"Domestic violence related assault - Greater Sydney Statistical Area, NSW"}]
[]
[null,"24-month trend:",{"$f":"'Working SA4'!C6","v":5.2},null,"Ratio to NSW:",{"$f":"'Working SA4'!$E2","v":0.81889774739999999},null,null,null,{"$f":"'Working SA4'!X1","v":"July 2022 - June 2023"},{"$f":"'Working SA4'!Y1","v":"July 2023 - June 2024"}]
[null,null,null,null,null,null,null,null,{"$f":"'Working LGA'!$C$10","v":"Number of reported incidents"},{"$f":"'Working SA4'!X2","v":18461},{"$f":"'Working SA4'!Y2","v":19417}]
[]
[]
[]
[]
[]
[]
[]
[]
[]
[]
[]
[]
[]
[]
[]
[]
[]
[]
[]
[]
[]
[]
[]
[]
[]
["Source: NSW Bureau of Crime Statistics and Research"]

{"sheet":"Graph LGA 24 months","index":3,"n_rows":31,"n_cols":11,"rows_kept":31,"cut":false,"hidden":false,"merged":[]}
[{"$f":"'Working LGA'!C8","v":"NSW Recorded Crime Statistics, July 2022 to June 2024"}]
[{"$f":"'Working LGA'!$C$9","v":"Domestic violence related assault - Albury Local Government Area, NSW"}]
[]
[null,"24-month trend:",{"$f":"'Working LGA'!C6","v":17.899999999999999},null,"Ratio to NSW:",{"$f":"'Working LGA'!$E2","v":1.7680844662999999},null,null,null,{"$f":"'Working LGA'!Y1","v":"July 2022 - June 2023"},{"$f":"'Working LGA'!Z1","v":"July 2023 - June 2024"}]
[null,null,null,null,null,null,null,null,{"$f":"'Working LGA'!$C$10","v":"Number of reported incidents"},{"$f":"'Working LGA'!Y2","v":380},{"$f":"'Working LGA'!Z2","v":448}]
[]
[]
[]
[]
[]
[]
[]
[]
[]
[]
[]
[]
[]
[]
[]
[]
[]
[]
[]
[]
[]
[]
[]
[]
[]
["Source: NSW Bureau of Crime Statistics and Research"]

{"sheet":"Graph NSW SA4 60 months","index":4,"n_rows":31,"n_cols":13,"rows_kept":31,"cut":false,"hidden":false,"merged":[]}
[{"$f":"'Working SA4'!C16","v":"NSW Recorded Crime Statistics, July 2019 to June 2024"}]
[{"$f":"'Working SA4'!$C$9","v":"Domestic violence related assault - Greater Sydney Statistical Area, NSW"}]
[]
[null,"60-month trend:",{"$f":"'Working SA4'!C14","v":2.1},null,"Ratio to NSW:",{"$f":"'Working SA4'!$E2","v":0.81889774739999999},null,null,{"$f":"'Working SA4'!U1","v":"July 2019 - June 2020"},{"$f":"'Working SA4'!V1","v":"July 2020 - June 2021"},{"$f":"'Working SA4'!W1","v":"July 2021 - June 2022"},{"$f":"'Working SA4'!X1","v":"July 2022 - June 2023"},{"$f":"'Working SA4'!Y1","v":"July 2023 - June 2024"}]
[null,null,null,null,null,null,null,{"$f":"'Working SA4'!$C$18","v":"Number of reported incidents"},{"$f":"'Working SA4'!U2","v":17869},{"$f":"'Working SA4'!V2","v":17865},{"$f":"'Working SA4'!W2","v":17386},{"$f":"'Working SA4'!X2","v":18461},{"$f":"'Working SA4'!Y2","v":19417}]
[]
[]
[]
[]
[]
[]
[]
[]
[]
[]
[]
[]
[]
[]
[]
[]
[]
[]
[]
[]
[]
[]
[]
[]
[]
["Source: NSW Bureau of Crime Statistics and Research"]

{"sheet":"Graph LGA 60 months","index":5,"n_rows":31,"n_cols":13,"rows_kept":31,"cut":false,"hidden":false,"merged":[]}
[{"$f":"'Working LGA'!C16","v":"NSW Recorded Crime Statistics, July 2019 to June 2024"}]
[{"$f":"'Working LGA'!$C$9","v":"Domestic violence related assault - Albury Local Government Area, NSW"}]
[]
[null,"60-month trend:",{"$f":"'Working LGA'!C14","v":9.3000000000000007},null,"Ratio to NSW:",{"$f":"'Working LGA'!$E2","v":1.7680844662999999},null,null,{"$f":"'Working LGA'!V1","v":"July 2019 - June 2020"},{"$f":"'Working LGA'!W1","v":"July 2020 - June 2021"},{"$f":"'Working LGA'!X1","v":"July 2021 - June 2022"},{"$f":"'Working LGA'!Y1","v":"July 2022 - June 2023"},{"$f":"'Working LGA'!Z1","v":"July 2023 - June 2024"}]
[null,null,null,null,null,null,null,{"$f":"'Working LGA'!$C$10","v":"Number of reported incidents"},{"$f":"'Working LGA'!V2","v":314},{"$f":"'Working LGA'!W2","v":337},{"$f":"'Working LGA'!X2","v":417},{"$f":"'Working LGA'!Y2","v":380},{"$f":"'Working LGA'!Z2","v":448}]
[]
[]
[]
[]
[]
[]
[]
[]
[]
[]
[]
[]
[]
[]
[]
[]
[]
[]
[]
[]
[]
[]
[]
[]
[]
["Source: NSW Bureau of Crime Statistics and Research"]

{"sheet":"Graph NSW SA4 120 months","index":6,"n_rows":31,"n_cols":18,"rows_kept":31,"cut":false,"hidden":false,"merged":[]}
[{"$f":"'Working SA4'!C24","v":"NSW Recorded Crime Statistics, July 2014 to June 2024"}]
[{"$f":"'Working SA4'!$C$9","v":"Domestic violence related assault - Greater Sydney Statistical Area, NSW"}]
[]
[null,"120-month trend:",{"$f":"'Working SA4'!C22","v":2.2000000000000002},null,"Ratio to NSW:",{"$f":"'Working SA4'!E2","v":0.81889774739999999},null,null,{"$f":"'Working SA4'!P1","v":"July 2014 - June 2015"},{"$f":"'Working SA4'!Q1","v":"July 2015 - June 2016"},{"$f":"'Working SA4'!R1","v":"July 2016 - June 2017"},{"$f":"'Working SA4'!S1","v":"July 2017 - June 2018"},{"$f":"'Working SA4'!T1","v":"July 2018 - June 2019"},{"$f":"'Working SA4'!U1","v":"July 2019 - June 2020"},{"$f":"'Working SA4'!V1","v":"July 2020 - June 2021"},{"$f":"'Working SA4'!W1","v":"July 2021 - June 2022"},{"$f":"'Working SA4'!X1","v":"July 2022 - June 2023"},{"$f":"'Working SA4'!Y1","v":"July 2023 - June 2024"}]
[null,null,null,null,null,null,null,{"$f":"'Working SA4'!$C$18","v":"Number of reported incidents"},{"$f":"'Working SA4'!P2","v":15930},{"$f":"'Working SA4'!Q2","v":16209},{"$f":"'Working SA4'!R2","v":16320},{"$f":"'Working SA4'!S2","v":15995},{"$f":"'Working SA4'!T2","v":17088},{"$f":"'Working SA4'!U2","v":17869},{"$f":"'Working SA4'!V2","v":17865},{"$f":"'Working SA4'!W2","v":17386},{"$f":"'Working SA4'!X2","v":18461},{"$f":"'Working SA4'!Y2","v":19417}]
[]
[]
[]
[]
[]
[]
[]
[]
[]
[]
[]
[]
[]
[]
[]
[]
[]
[]
[]
[]
[]
[]
[]
[]
[]
["Source: NSW Bureau of Crime Statistics and Research"]

{"sheet":"Graph LGA 120 months","index":7,"n_rows":31,"n_cols":18,"rows_kept":31,"cut":false,"hidden":false,"merged":[]}
[{"$f":"'Working LGA'!C24","v":"NSW Recorded Crime Statistics, July 2014 to June 2024"}]
[{"$f":"'Working LGA'!$C$9","v":"Domestic violence related assault - Albury Local Government Area, NSW"}]
[]
[null,"120-month trend:",{"$f":"'Working LGA'!C22","v":5.4},null,"Ratio to NSW:",{"$f":"'Working LGA'!E2","v":1.7680844662999999},null,null,{"$f":"'Working LGA'!Q1","v":"July 2014 - June 2015"},{"$f":"'Working LGA'!R1","v":"July 2015 - June 2016"},{"$f":"'Working LGA'!S1","v":"July 2016 - June 2017"},{"$f":"'Working LGA'!T1","v":"July 2017 - June 2018"},{"$f":"'Working LGA'!U1","v":"July 2018 - June 2019"},{"$f":"'Working LGA'!V1","v":"July 2019 - June 2020"},{"$f":"'Working LGA'!W1","v":"July 2020 - June 2021"},{"$f":"'Working LGA'!X1","v":"July 2021 - June 2022"},{"$f":"'Working LGA'!Y1","v":"July 2022 - June 2023"},{"$f":"'Working LGA'!Z1","v":"July 2023 - June 2024"}]
[null,null,null,null,null,null,null,{"$f":"'Working LGA'!$C$10","v":"Number of reported incidents"},{"$f":"'Working LGA'!Q2","v":279},{"$f":"'Working LGA'!R2","v":273},{"$f":"'Working LGA'!S2","v":297},{"$f":"'Working LGA'!T2","v":271},{"$f":"'Working LGA'!U2","v":294},{"$f":"'Working LGA'!V2","v":314},{"$f":"'Working LGA'!W2","v":337},{"$f":"'Working LGA'!X2","v":417},{"$f":"'Working LGA'!Y2","v":380},{"$f":"'Working LGA'!Z2","v":448}]
[]
[]
[]
[]
[]
[]
[]
[]
[]
[]
[]
[]
[]
[]
[]
[]
[]
[]
[]
[]
[]
[]
[]
[]
[]
["Source: NSW Bureau of Crime Statistics and Research"]

{"sheet":"Working SA4","index":8,"n_rows":26,"n_cols":145,"rows_kept":26,"cut":false,"hidden":true,"merged":[]}
[{"$f":"'Table 1 SA4'!A7","v":"NSW Statistical Area"},{"$f":"'Table 1 SA4'!B7","v":"Two year trend (%)"},{"$f":"'Table 1 SA4'!C7","v":"Five year trend (annual average % change)"},{"$f":"'Table 1 SA4'!D7","v":"Ten year trend (annual average % change)"},{"$f":"'Table 1 SA4'!E7","v":"Ratio to NSW"},{"$f":"'Table 1 SA4'!F7","v":"July 2014 - June 2015"},{"$f":"'Table 1 SA4'!G7","v":"July 2015 - June 2016"},{"$f":"'Table 1 SA4'!H7","v":"July 2016 - June 2017"},{"$f":"'Table 1 SA4'!I7","v":"July 2017 - June 2018"},{"$f":"'Table 1 SA4'!J7","v":"July 2018 - June 2019"},{"$f":"'Table 1 SA4'!K7","v":"July 2019 - June 2020"},{"$f":"'Table 1 SA4'!L7","v":"July 2020 - June 2021"},{"$f":"'Table 1 SA4'!M7","v":"July 2021 - June 2022"},{"$f":"'Table 1 SA4'!N7","v":"July 2022 - June 2023"},{"$f":"'Table 1 SA4'!O7","v":"July 2023 - June 2024"},{"$f":"'Table 1 SA4'!P7","v":"July 2014 - June 2015"},{"$f":"'Table 1 SA4'!Q7","v":"July 2015 - June 2016"},{"$f":"'Table 1 SA4'!R7","v":"July 2016 - June 2017"},{"$f":"'Table 1 SA4'!S7","v":"July 2017 - June 2018"},{"$f":"'Table 1 SA4'!T7","v":"July 2018 - June 2019"},{"$f":"'Table 1 SA4'!U7","v":"July 2019 - June 2020"},{"$f":"'Table 1 SA4'!V7","v":"July 2020 - June 2021"},{"$f":"'Table 1 SA4'!W7","v":"July 2021 - June 2022"},{"$f":"'Table 1 SA4'!X7","v":"July 2022 - June 2023"},{"$f":"'Table 1 SA4'!Y7","v":"July 2023 - June 2024"},{"$f":"'Table 1 SA4'!Z7","v":"2014-07-01"},{"$f":"'Table 1 SA4'!AA7","v":"2014-08-01"},{"$f":"'Table 1 SA4'!AB7","v":"2014-09-01"},{"$f":"'Table 1 SA4'!AC7","v":"2014-10-01"},{"$f":"'Table 1 SA4'!AD7","v":"2014-11-01"},{"$f":"'Table 1 SA4'!AE7","v":"2014-12-01"},{"$f":"'Table 1 SA4'!AF7","v":"2015-01-01"},{"$f":"'Table 1 SA4'!AG7","v":"2015-02-01"},{"$f":"'Table 1 SA4'!AH7","v":"2015-03-01"},{"$f":"'Table 1 SA4'!AI7","v":"2015-04-01"},{"$f":"'Table 1 SA4'!AJ7","v":"2015-05-01"},{"$f":"'Table 1 SA4'!AK7","v":"2015-06-01"},{"$f":"'Table 1 SA4'!AL7","v":"2015-07-01"},{"$f":"'Table 1 SA4'!AM7","v":"2015-08-01"},{"$f":"'Table 1 SA4'!AN7","v":"2015-09-01"},{"$f":"'Table 1 SA4'!AO7","v":"2015-10-01"},{"$f":"'Table 1 SA4'!AP7","v":"2015-11-01"},{"$f":"'Table 1 SA4'!AQ7","v":"2015-12-01"},{"$f":"'Table 1 SA4'!AR7","v":"2016-01-01"},{"$f":"'Table 1 SA4'!AS7","v":"2016-02-01"},{"$f":"'Table 1 SA4'!AT7","v":"2016-03-01"},{"$f":"'Table 1 SA4'!AU7","v":"2016-04-01"},{"$f":"'Table 1 SA4'!AV7","v":"2016-05-01"},{"$f":"'Table 1 SA4'!AW7","v":"2016-06-01"},{"$f":"'Table 1 SA4'!AX7","v":"2016-07-01"},{"$f":"'Table 1 SA4'!AY7","v":"2016-08-01"},{"$f":"'Table 1 SA4'!AZ7","v":"2016-09-01"},{"$f":"'Table 1 SA4'!BA7","v":"2016-10-01"},{"$f":"'Table 1 SA4'!BB7","v":"2016-11-01"},{"$f":"'Table 1 SA4'!BC7","v":"2016-12-01"},{"$f":"'Table 1 SA4'!BD7","v":"2017-01-01"},{"$f":"'Table 1 SA4'!BE7","v":"2017-02-01"},{"$f":"'Table 1 SA4'!BF7","v":"2017-03-01"},{"$f":"'Table 1 SA4'!BG7","v":"2017-04-01"},{"$f":"'Table 1 SA4'!BH7","v":"2017-05-01"},{"$f":"'Table 1 SA4'!BI7","v":"2017-06-01"},{"$f":"'Table 1 SA4'!BJ7","v":"2017-07-01"},{"$f":"'Table 1 SA4'!BK7","v":"2017-08-01"},{"$f":"'Table 1 SA4'!BL7","v":"2017-09-01"},{"$f":"'Table 1 SA4'!BM7","v":"2017-10-01"},{"$f":"'Table 1 SA4'!BN7","v":"2017-11-01"},{"$f":"'Table 1 SA4'!BO7","v":"2017-12-01"},{"$f":"'Table 1 SA4'!BP7","v":"2018-01-01"},{"$f":"'Table 1 SA4'!BQ7","v":"2018-02-01"},{"$f":"'Table 1 SA4'!BR7","v":"2018-03-01"},{"$f":"'Table 1 SA4'!BS7","v":"2018-04-01"},{"$f":"'Table 1 SA4'!BT7","v":"2018-05-01"},{"$f":"'Table 1 SA4'!BU7","v":"2018-06-01"},{"$f":"'Table 1 SA4'!BV7","v":"2018-07-01"},{"$f":"'Table 1 SA4'!BW7","v":"2018-08-01"},{"$f":"'Table 1 SA4'!BX7","v":"2018-09-01"},{"$f":"'Table 1 SA4'!BY7","v":"2018-10-01"},{"$f":"'Table 1 SA4'!BZ7","v":"2018-11-01"},{"$f":"'Table 1 SA4'!CA7","v":"2018-12-01"},{"$f":"'Table 1 SA4'!CB7","v":"2019-01-01"},{"$f":"'Table 1 SA4'!CC7","v":"2019-02-01"},{"$f":"'Table 1 SA4'!CD7","v":"2019-03-01"},{"$f":"'Table 1 SA4'!CE7","v":"2019-04-01"},{"$f":"'Table 1 SA4'!CF7","v":"2019-05-01"},{"$f":"'Table 1 SA4'!CG7","v":"2019-06-01"},{"$f":"'Table 1 SA4'!CH7","v":"2019-07-01"},{"$f":"'Table 1 SA4'!CI7","v":"2019-08-01"},{"$f":"'Table 1 SA4'!CJ7","v":"2019-09-01"},{"$f":"'Table 1 SA4'!CK7","v":"2019-10-01"},{"$f":"'Table 1 SA4'!CL7","v":"2019-11-01"},{"$f":"'Table 1 SA4'!CM7","v":"2019-12-01"},{"$f":"'Table 1 SA4'!CN7","v":"2020-01-01"},{"$f":"'Table 1 SA4'!CO7","v":"2020-02-01"},{"$f":"'Table 1 SA4'!CP7","v":"2020-03-01"},{"$f":"'Table 1 SA4'!CQ7","v":"2020-04-01"},{"$f":"'Table 1 SA4'!CR7","v":"2020-05-01"},{"$f":"'Table 1 SA4'!CS7","v":"2020-06-01"},{"$f":"'Table 1 SA4'!CT7","v":"2020-07-01"},{"$f":"'Table 1 SA4'!CU7","v":"2020-08-01"},{"$f":"'Table 1 SA4'!CV7","v":"2020-09-01"},{"$f":"'Table 1 SA4'!CW7","v":"2020-10-01"},{"$f":"'Table 1 SA4'!CX7","v":"2020-11-01"},{"$f":"'Table 1 SA4'!CY7","v":"2020-12-01"},{"$f":"'Table 1 SA4'!CZ7","v":"2021-01-01"},{"$f":"'Table 1 SA4'!DA7","v":"2021-02-01"},{"$f":"'Table 1 SA4'!DB7","v":"2021-03-01"},{"$f":"'Table 1 SA4'!DC7","v":"2021-04-01"},{"$f":"'Table 1 SA4'!DD7","v":"2021-05-01"},{"$f":"'Table 1 SA4'!DE7","v":"2021-06-01"},{"$f":"'Table 1 SA4'!DF7","v":"2021-07-01"},{"$f":"'Table 1 SA4'!DG7","v":"2021-08-01"},{"$f":"'Table 1 SA4'!DH7","v":"2021-09-01"},{"$f":"'Table 1 SA4'!DI7","v":"2021-10-01"},{"$f":"'Table 1 SA4'!DJ7","v":"2021-11-01"},{"$f":"'Table 1 SA4'!DK7","v":"2021-12-01"},{"$f":"'Table 1 SA4'!DL7","v":"2022-01-01"},{"$f":"'Table 1 SA4'!DM7","v":"2022-02-01"},{"$f":"'Table 1 SA4'!DN7","v":"2022-03-01"},{"$f":"'Table 1 SA4'!DO7","v":"2022-04-01"},{"$f":"'Table 1 SA4'!DP7","v":"2022-05-01"},{"$f":"'Table 1 SA4'!DQ7","v":"2022-06-01"},{"$f":"'Table 1 SA4'!DR7","v":"2022-07-01"},{"$f":"'Table 1 SA4'!DS7","v":"2022-08-01"},{"$f":"'Table 1 SA4'!DT7","v":"2022-09-01"},{"$f":"'Table 1 SA4'!DU7","v":"2022-10-01"},{"$f":"'Table 1 SA4'!DV7","v":"2022-11-01"},{"$f":"'Table 1 SA4'!DW7","v":"2022-12-01"},{"$f":"'Table 1 SA4'!DX7","v":"2023-01-01"},{"$f":"'Table 1 SA4'!DY7","v":"2023-02-01"},{"$f":"'Table 1 SA4'!DZ7","v":"2023-03-01"},{"$f":"'Table 1 SA4'!EA7","v":"2023-04-01"},{"$f":"'Table 1 SA4'!EB7","v":"2023-05-01"},{"$f":"'Table 1 SA4'!EC7","v":"2023-06-01"},{"$f":"'Table 1 SA4'!ED7","v":"2023-07-01"},{"$f":"'Table 1 SA4'!EE7","v":"2023-08-01"},{"$f":"'Table 1 SA4'!EF7","v":"2023-09-01"},{"$f":"'Table 1 SA4'!EG7","v":"2023-10-01"},{"$f":"'Table 1 SA4'!EH7","v":"2023-11-01"},{"$f":"'Table 1 SA4'!EI7","v":"2023-12-01"},{"$f":"'Table 1 SA4'!EJ7","v":"2024-01-01"},{"$f":"'Table 1 SA4'!EK7","v":"2024-02-01"},{"$f":"'Table 1 SA4'!EL7","v":"2024-03-01"},{"$f":"'Table 1 SA4'!EM7","v":"2024-04-01"},{"$f":"'Table 1 SA4'!EN7","v":"2024-05-01"},{"$f":"'Table 1 SA4'!EO7","v":"2024-06-01"}]
["Greater Sydney",5.2,2.1,2.2000000000000002,0.81889774739999999,323.10000000000002,322.60000000000002,317.7,306.10000000000002,321.8,338.1,339.5,327.9,348.1,366.2,15930,16209,16320,15995,17088,17869,17865,17386,18461,19417,1321,1247,1132,1235,1250,1240,1427,1389,1465,1484,1284,1456,1310,1224,1220,1185,1286,1195,1360,1482,1528,1437,1416,1566,1320,1259,1214,1238,1201,1253,1371,1406,1607,1618,1398,1435,1284,1253,1149,1171,1176,1293,1427,1330,1622,1578,1279,1433,1328,1194,1328,1271,1264,1311,1400,1466,1886,1709,1438,1493,1406,1328,1332,1366,1419,1427,1511,1509,1716,1778,1452,1625,1304,1391,1534,1377,1423,1429,1581,1616,1685,1572,1437,1516,1538,1518,1392,1297,1198,1229,1449,1589,1627,1534,1397,1618,1465,1422,1338,1487,1568,1482,1516,1534,1661,1641,1632,1715,1454,1374,1534,1519,1567,1586,1636,1627,1905,1706,1665,1844]
[]
[null,"start month:",{"$f":"DR1","v":"2022-07-01"}]
[null,"end month:",{"$f":"EO1","v":"2024-06-01"}]
[null,"% change:",{"$f":"IF(ISNUMBER(B2),B2,\"Not significant\")","v":5.2}]
[]
[null,"first title for Graph NSW SA4:",{"$f":"\"NSW Recorded Crime Statistics, \"&TEXT($C$4,\"mmmm yyyy\")&\" to \"&TEXT($C$5,\"mmmm yyyy\")","v":"NSW Recorded Crime Statistics, July 2022 to June 2024"}]
[null,"second title for Graph NSW SA4:",{"$f":"IF(OR(A2=\"NSW**\", A2=\"Regional NSW\"), \"Domestic violence related assault - \" & A2, \"Domestic violence related assault - \" & A2 & \" Statistical Area, NSW\")","v":"Domestic violence related assault - Greater Sydney Statistical Area, NSW"}]
[null,"axis text:","Number of reported incidents"]
[]
[null,"start month:",{"$f":"CH1","v":"2019-07-01"}]
[null,"end month:",{"$f":"EO1","v":"2024-06-01"}]
[null,"% change:",{"$f":"IF(ISNUMBER(C2),C2,\"Not significant\")","v":2.1}]
[]
[null,"first title for Graph NSW SA4:",{"$f":"\"NSW Recorded Crime Statistics, \"&TEXT($C$12,\"mmmm yyyy\")&\" to \"&TEXT($C$13,\"mmmm yyyy\")","v":"NSW Recorded Crime Statistics, July 2019 to June 2024"}]
[null,"second title for Graph NSW SA4:",{"$f":"IF(OR(A2=\"NSW\",A2=\"Regional NSW\"), \"Domestic violence related assault - \" & A2, \"Domestic violence related assault - \" & A2 & \" Statistical Area, NSW\")","v":"Domestic violence related assault - Greater Sydney Statistical Area, NSW"}]
[null,"axis text:","Number of reported incidents"]
[]
[null,"start month:",{"$f":"Z1","v":"2014-07-01"}]
[null,"end month:",{"$f":"EO1","v":"2024-06-01"}]
[null,"% change:",{"$f":"IF(ISNUMBER(D2),D2,\"Not significant\")","v":2.2000000000000002}]
[]
[null,"first title for Graph NSW SA4:",{"$f":"\"NSW Recorded Crime Statistics, \"&TEXT($C$20,\"mmmm yyyy\")&\" to \"&TEXT($C$21,\"mmmm yyyy\")","v":"NSW Recorded Crime Statistics, July 2014 to June 2024"}]
[null,"second title for Graph NSW SA4:",{"$f":"IF(OR(A2=\"NSW**\", A2=\"Regional NSW\"), \"Domestic violence related assault - \" & A2, \"Domestic violence related assault - \" & A2 & \" Statistical Area, NSW\")","v":"Domestic violence related assault - Greater Sydney Statistical Area, NSW"}]
[null,"axis text:","Number of reported incidents"]

{"sheet":"Working LGA","index":9,"n_rows":26,"n_cols":146,"rows_kept":26,"cut":false,"hidden":true,"merged":[]}
[{"$f":"'Table 2 LGA'!A7","v":"NSW Local Government Area"},{"$f":"'Table 2 LGA'!B7","v":"Two year trend (%)"},{"$f":"'Table 2 LGA'!C7","v":"Five year trend (annual average % change)"},{"$f":"'Table 2 LGA'!D7","v":"Ten year trend (annual average % change)"},{"$f":"'Table 2 LGA'!E7","v":"Ratio to NSW"},{"$f":"'Table 2 LGA'!F7","v":"Rank"},{"$f":"'Table 2 LGA'!G7","v":"July 2014 - June 2015"},{"$f":"'Table 2 LGA'!H7","v":"July 2015 - June 2016"},{"$f":"'Table 2 LGA'!I7","v":"July 2016 - June 2017"},{"$f":"'Table 2 LGA'!J7","v":"July 2017 - June 2018"},{"$f":"'Table 2 LGA'!K7","v":"July 2018 - June 2019"},{"$f":"'Table 2 LGA'!L7","v":"July 2019 - June 2020"},{"$f":"'Table 2 LGA'!M7","v":"July 2020 - June 2021"},{"$f":"'Table 2 LGA'!N7","v":"July 2021 - June 2022"},{"$f":"'Table 2 LGA'!O7","v":"July 2022 - June 2023"},{"$f":"'Table 2 LGA'!P7","v":"July 2023 - June 2024"},{"$f":"'Table 2 LGA'!Q7","v":"July 2014 - June 2015"},{"$f":"'Table 2 LGA'!R7","v":"July 2015 - June 2016"},{"$f":"'Table 2 LGA'!S7","v":"July 2016 - June 2017"},{"$f":"'Table 2 LGA'!T7","v":"July 2017 - June 2018"},{"$f":"'Table 2 LGA'!U7","v":"July 2018 - June 2019"},{"$f":"'Table 2 LGA'!V7","v":"July 2019 - June 2020"},{"$f":"'Table 2 LGA'!W7","v":"July 2020 - June 2021"},{"$f":"'Table 2 LGA'!X7","v":"July 2021 - June 2022"},{"$f":"'Table 2 LGA'!Y7","v":"July 2022 - June 2023"},{"$f":"'Table 2 LGA'!Z7","v":"July 2023 - June 2024"},{"$f":"'Table 2 LGA'!AA7","v":"2014-07-01"},{"$f":"'Table 2 LGA'!AB7","v":"2014-08-01"},{"$f":"'Table 2 LGA'!AC7","v":"2014-09-01"},{"$f":"'Table 2 LGA'!AD7","v":"2014-10-01"},{"$f":"'Table 2 LGA'!AE7","v":"2014-11-01"},{"$f":"'Table 2 LGA'!AF7","v":"2014-12-01"},{"$f":"'Table 2 LGA'!AG7","v":"2015-01-01"},{"$f":"'Table 2 LGA'!AH7","v":"2015-02-01"},{"$f":"'Table 2 LGA'!AI7","v":"2015-03-01"},{"$f":"'Table 2 LGA'!AJ7","v":"2015-04-01"},{"$f":"'Table 2 LGA'!AK7","v":"2015-05-01"},{"$f":"'Table 2 LGA'!AL7","v":"2015-06-01"},{"$f":"'Table 2 LGA'!AM7","v":"2015-07-01"},{"$f":"'Table 2 LGA'!AN7","v":"2015-08-01"},{"$f":"'Table 2 LGA'!AO7","v":"2015-09-01"},{"$f":"'Table 2 LGA'!AP7","v":"2015-10-01"},{"$f":"'Table 2 LGA'!AQ7","v":"2015-11-01"},{"$f":"'Table 2 LGA'!AR7","v":"2015-12-01"},{"$f":"'Table 2 LGA'!AS7","v":"2016-01-01"},{"$f":"'Table 2 LGA'!AT7","v":"2016-02-01"},{"$f":"'Table 2 LGA'!AU7","v":"2016-03-01"},{"$f":"'Table 2 LGA'!AV7","v":"2016-04-01"},{"$f":"'Table 2 LGA'!AW7","v":"2016-05-01"},{"$f":"'Table 2 LGA'!AX7","v":"2016-06-01"},{"$f":"'Table 2 LGA'!AY7","v":"2016-07-01"},{"$f":"'Table 2 LGA'!AZ7","v":"2016-08-01"},{"$f":"'Table 2 LGA'!BA7","v":"2016-09-01"},{"$f":"'Table 2 LGA'!BB7","v":"2016-10-01"},{"$f":"'Table 2 LGA'!BC7","v":"2016-11-01"},{"$f":"'Table 2 LGA'!BD7","v":"2016-12-01"},{"$f":"'Table 2 LGA'!BE7","v":"2017-01-01"},{"$f":"'Table 2 LGA'!BF7","v":"2017-02-01"},{"$f":"'Table 2 LGA'!BG7","v":"2017-03-01"},{"$f":"'Table 2 LGA'!BH7","v":"2017-04-01"},{"$f":"'Table 2 LGA'!BI7","v":"2017-05-01"},{"$f":"'Table 2 LGA'!BJ7","v":"2017-06-01"},{"$f":"'Table 2 LGA'!BK7","v":"2017-07-01"},{"$f":"'Table 2 LGA'!BL7","v":"2017-08-01"},{"$f":"'Table 2 LGA'!BM7","v":"2017-09-01"},{"$f":"'Table 2 LGA'!BN7","v":"2017-10-01"},{"$f":"'Table 2 LGA'!BO7","v":"2017-11-01"},{"$f":"'Table 2 LGA'!BP7","v":"2017-12-01"},{"$f":"'Table 2 LGA'!BQ7","v":"2018-01-01"},{"$f":"'Table 2 LGA'!BR7","v":"2018-02-01"},{"$f":"'Table 2 LGA'!BS7","v":"2018-03-01"},{"$f":"'Table 2 LGA'!BT7","v":"2018-04-01"},{"$f":"'Table 2 LGA'!BU7","v":"2018-05-01"},{"$f":"'Table 2 LGA'!BV7","v":"2018-06-01"},{"$f":"'Table 2 LGA'!BW7","v":"2018-07-01"},{"$f":"'Table 2 LGA'!BX7","v":"2018-08-01"},{"$f":"'Table 2 LGA'!BY7","v":"2018-09-01"},{"$f":"'Table 2 LGA'!BZ7","v":"2018-10-01"},{"$f":"'Table 2 LGA'!CA7","v":"2018-11-01"},{"$f":"'Table 2 LGA'!CB7","v":"2018-12-01"},{"$f":"'Table 2 LGA'!CC7","v":"2019-01-01"},{"$f":"'Table 2 LGA'!CD7","v":"2019-02-01"},{"$f":"'Table 2 LGA'!CE7","v":"2019-03-01"},{"$f":"'Table 2 LGA'!CF7","v":"2019-04-01"},{"$f":"'Table 2 LGA'!CG7","v":"2019-05-01"},{"$f":"'Table 2 LGA'!CH7","v":"2019-06-01"},{"$f":"'Table 2 LGA'!CI7","v":"2019-07-01"},{"$f":"'Table 2 LGA'!CJ7","v":"2019-08-01"},{"$f":"'Table 2 LGA'!CK7","v":"2019-09-01"},{"$f":"'Table 2 LGA'!CL7","v":"2019-10-01"},{"$f":"'Table 2 LGA'!CM7","v":"2019-11-01"},{"$f":"'Table 2 LGA'!CN7","v":"2019-12-01"},{"$f":"'Table 2 LGA'!CO7","v":"2020-01-01"},{"$f":"'Table 2 LGA'!CP7","v":"2020-02-01"},{"$f":"'Table 2 LGA'!CQ7","v":"2020-03-01"},{"$f":"'Table 2 LGA'!CR7","v":"2020-04-01"},{"$f":"'Table 2 LGA'!CS7","v":"2020-05-01"},{"$f":"'Table 2 LGA'!CT7","v":"2020-06-01"},{"$f":"'Table 2 LGA'!CU7","v":"2020-07-01"},{"$f":"'Table 2 LGA'!CV7","v":"2020-08-01"},{"$f":"'Table 2 LGA'!CW7","v":"2020-09-01"},{"$f":"'Table 2 LGA'!CX7","v":"2020-10-01"},{"$f":"'Table 2 LGA'!CY7","v":"2020-11-01"},{"$f":"'Table 2 LGA'!CZ7","v":"2020-12-01"},{"$f":"'Table 2 LGA'!DA7","v":"2021-01-01"},{"$f":"'Table 2 LGA'!DB7","v":"2021-02-01"},{"$f":"'Table 2 LGA'!DC7","v":"2021-03-01"},{"$f":"'Table 2 LGA'!DD7","v":"2021-04-01"},{"$f":"'Table 2 LGA'!DE7","v":"2021-05-01"},{"$f":"'Table 2 LGA'!DF7","v":"2021-06-01"},{"$f":"'Table 2 LGA'!DG7","v":"2021-07-01"},{"$f":"'Table 2 LGA'!DH7","v":"2021-08-01"},{"$f":"'Table 2 LGA'!DI7","v":"2021-09-01"},{"$f":"'Table 2 LGA'!DJ7","v":"2021-10-01"},{"$f":"'Table 2 LGA'!DK7","v":"2021-11-01"},{"$f":"'Table 2 LGA'!DL7","v":"2021-12-01"},{"$f":"'Table 2 LGA'!DM7","v":"2022-01-01"},{"$f":"'Table 2 LGA'!DN7","v":"2022-02-01"},{"$f":"'Table 2 LGA'!DO7","v":"2022-03-01"},{"$f":"'Table 2 LGA'!DP7","v":"2022-04-01"},{"$f":"'Table 2 LGA'!DQ7","v":"2022-05-01"},{"$f":"'Table 2 LGA'!DR7","v":"2022-06-01"},{"$f":"'Table 2 LGA'!DS7","v":"2022-07-01"},{"$f":"'Table 2 LGA'!DT7","v":"2022-08-01"},{"$f":"'Table 2 LGA'!DU7","v":"2022-09-01"},{"$f":"'Table 2 LGA'!DV7","v":"2022-10-01"},{"$f":"'Table 2 LGA'!DW7","v":"2022-11-01"},{"$f":"'Table 2 LGA'!DX7","v":"2022-12-01"},{"$f":"'Table 2 LGA'!DY7","v":"2023-01-01"},{"$f":"'Table 2 LGA'!DZ7","v":"2023-02-01"},{"$f":"'Table 2 LGA'!EA7","v":"2023-03-01"},{"$f":"'Table 2 LGA'!EB7","v":"2023-04-01"},{"$f":"'Table 2 LGA'!EC7","v":"2023-05-01"},{"$f":"'Table 2 LGA'!ED7","v":"2023-06-01"},{"$f":"'Table 2 LGA'!EE7","v":"2023-07-01"},{"$f":"'Table 2 LGA'!EF7","v":"2023-08-01"},{"$f":"'Table 2 LGA'!EG7","v":"2023-09-01"},{"$f":"'Table 2 LGA'!EH7","v":"2023-10-01"},{"$f":"'Table 2 LGA'!EI7","v":"2023-11-01"},{"$f":"'Table 2 LGA'!EJ7","v":"2023-12-01"},{"$f":"'Table 2 LGA'!EK7","v":"2024-01-01"},{"$f":"'Table 2 LGA'!EL7","v":"2024-02-01"},{"$f":"'Table 2 LGA'!EM7","v":"2024-03-01"},{"$f":"'Table 2 LGA'!EN7","v":"2024-04-01"},{"$f":"'Table 2 LGA'!EO7","v":"2024-05-01"},{"$f":"'Table 2 LGA'!EP7","v":"2024-06-01"}]
["Albury",17.899999999999999,9.3000000000000007,5.4,1.7680844662999999,25,541.9,523.29999999999995,560.5,504.6,541,567.29999999999995,601.1,735.9,670.6,790.6,279,273,297,271,294,314,337,417,380,448,17,22,24,18,30,23,23,25,27,32,23,15,17,34,30,17,18,22,14,25,21,18,28,29,16,20,20,18,27,23,32,24,29,28,31,29,22,10,26,15,20,28,21,26,27,28,26,22,32,30,24,16,17,16,27,18,30,24,29,31,14,13,22,28,31,27,22,25,31,27,38,36,20,33,22,12,33,23,25,30,29,34,45,31,22,22,31,23,33,30,36,48,50,39,49,34,25,23,19,30,42,35,32,41,39,35,27,32,23,37,30,35,54,34,48,32,31,44,43,37]
[]
[null,"start month:",{"$f":"DS1","v":"2022-07-01"}]
[null,"end month:",{"$f":"EP1","v":"2024-06-01"}]
[null,"% change:",{"$f":"IF(ISNUMBER(B2),B2,\"Not significant\")","v":17.899999999999999}]
[]
[null,"first title for Graph LGA:",{"$f":"\"NSW Recorded Crime Statistics, \"&TEXT($C$4,\"mmmm yyyy\")&\" to \"&TEXT($C$5,\"mmmm yyyy\")","v":"NSW Recorded Crime Statistics, July 2022 to June 2024"}]
[null,"second title for Graph LGA:",{"$f":"IF(A2=\"NSW**\", \"Domestic violence related assault - \" & A2, \"Domestic violence related assault - \" & A2 & \" Local Government Area, NSW\")","v":"Domestic violence related assault - Albury Local Government Area, NSW"}]
[null,"axis text:","Number of reported incidents"]
[]
[null,"start month:",{"$f":"CI1","v":"2019-07-01"}]
[null,"end month:",{"$f":"EP1","v":"2024-06-01"}]
[null,"% change:",{"$f":"IF(ISNUMBER(C2),C2,\"Not significant\")","v":9.3000000000000007}]
[]
[null,"first title for Graph LGA:",{"$f":"\"NSW Recorded Crime Statistics, \"&TEXT($C$12,\"mmmm yyyy\")&\" to \"&TEXT($C$13,\"mmmm yyyy\")","v":"NSW Recorded Crime Statistics, July 2019 to June 2024"}]
[null,"second title for Graph LGA:",{"$f":"IF(A2=\"NSW**\", \"Domestic violence related assault - \" & A2, \"Domestic violence related assault - \" & A2 & \" Local Government Area, NSW\")","v":"Domestic violence related assault - Albury Local Government Area, NSW"}]
[null,"axis text:","Number of reported incidents"]
[]
[null,"start month:",{"$f":"AA1","v":"2014-07-01"}]
[null,"end month:",{"$f":"EP1","v":"2024-06-01"}]
[null,"% change:",{"$f":"IF(ISNUMBER(D2),D2,\"Not significant\")","v":5.4}]
[]
[null,"first title for Graph LGA:",{"$f":"\"NSW Recorded Crime Statistics, \"&TEXT($C$20,\"mmmm yyyy\")&\" to \"&TEXT($C$21,\"mmmm yyyy\")","v":"NSW Recorded Crime Statistics, July 2014 to June 2024"}]
[null,"second title for Graph LGA:",{"$f":"IF(A2=\"NSW**\", \"Domestic violence related assault - \" & A2, \"Domestic violence related assault - \" & A2 & \" Local Government Area, NSW\")","v":"Domestic violence related assault - Albury Local Government Area, NSW"}]
[null,"axis text:","Number of reported incidents"]